BDBM50063721 2-(2-Iodo-phenylamino)-7-nitro-benzo[d][1,3]oxazin-4-one::CHEMBL10065
SMILES: [O-][N+](=O)c1ccc2c(c1)nc(Nc1ccccc1I)oc2=O
InChI Key: InChIKey=FPVBAAYYWDYGKN-UHFFFAOYSA-N
Data: 3 IC50
Activity Spreadsheet -- Enzyme Inhibition Constant Data from BindingDB
Found 3 hits for monomerid = 50063721
Trg + Lig
Ki
nM
ΔG°
kcal/mole
IC50
nM
Kd
nM
EC50/IC50
nM
koff
s-1
kon
M-1s-1
pHTemp
°C
Complement C1r subcomponent
(Homo sapiens (Human))
BDBM50063721
(2-(2-Iodo-phenylamino)-7-nitro-benzo[d][1,3]oxazin...)
Show SMILES [O-][N+](=O)c1ccc2c(c1)nc(Nc1ccccc1I)oc2=O
Show InChI InChI=1S/C14H8IN3O4/c15-10-3-1-2-4-11(10)16-14-17-12-7-8(18(20)21)5-6-9(12)13(19)22-14/h1-7H,(H,16,17)
Reactome pathway
n/an/a 800n/an/an/an/an/an/a
Warner-Lambert Company
Curated by ChEMBL
Assay Description
Inhibition of 50% of human C1r Serine Protease by initially using CbzGly-Arg-S-Bzl as substrate
J Med Chem 41: 1060-7 (1998)
Article DOI: 10.1021/jm970394d
BindingDB Entry DOI: 10.7270/Q2PZ57ZT
Trypsin
(Bos taurus (bovine))
BDBM50063721
(2-(2-Iodo-phenylamino)-7-nitro-benzo[d][1,3]oxazin...)
Show SMILES [O-][N+](=O)c1ccc2c(c1)nc(Nc1ccccc1I)oc2=O
Show InChI InChI=1S/C14H8IN3O4/c15-10-3-1-2-4-11(10)16-14-17-12-7-8(18(20)21)5-6-9(12)13(19)22-14/h1-7H,(H,16,17)
n/an/a>1.00E+5n/an/an/an/an/an/a
Warner-Lambert Company
Curated by ChEMBL
Assay Description
Concentration of compound required to inhibit 50% trypsin derived from bovine pancreas
J Med Chem 41: 1060-7 (1998)
Article DOI: 10.1021/jm970394d
BindingDB Entry DOI: 10.7270/Q2PZ57ZT
Complement C1r subcomponent
(Homo sapiens (Human))
BDBM50063721
(2-(2-Iodo-phenylamino)-7-nitro-benzo[d][1,3]oxazin...)
Show SMILES [O-][N+](=O)c1ccc2c(c1)nc(Nc1ccccc1I)oc2=O
Show InChI InChI=1S/C14H8IN3O4/c15-10-3-1-2-4-11(10)16-14-17-12-7-8(18(20)21)5-6-9(12)13(19)22-14/h1-7H,(H,16,17)
Reactome pathway
n/an/a 7.80E+3n/an/an/an/an/an/a
Warner-Lambert Company
Curated by ChEMBL
Assay Description
50% inhibition of human C1r serine protease after 60 mins using CbzGly-Arg-S-Bzl as substrate
J Med Chem 41: 1060-7 (1998)
Article DOI: 10.1021/jm970394d
BindingDB Entry DOI: 10.7270/Q2PZ57ZT