BDBM50063868 CHEMBL3400916
SMILES: OC(=O)CC1NCCc2c1[nH]c1ccc(OCc3ccc(OC(F)(F)F)c(Cl)c3)cc21
InChI Key: InChIKey=DRVBYYXHAMUCCK-UHFFFAOYSA-N
Data: 1 EC50
Activity Spreadsheet -- Enzyme Inhibition Constant Data from BindingDB
Found 1 hit for monomerid = 50063868
Trg + Lig
Ki
nM
ΔG°
kcal/mole
IC50
nM
Kd
nM
EC50/IC50
nM
koff
s-1
kon
M-1s-1
pHTemp
°C
Sphingosine 1-phosphate receptor 1
(Homo sapiens (Human))
BDBM50063868
(CHEMBL3400916)
Show SMILES OC(=O)CC1NCCc2c1[nH]c1ccc(OCc3ccc(OC(F)(F)F)c(Cl)c3)cc21
Show InChI InChI=1S/C21H18ClF3N2O4/c22-15-7-11(1-4-18(15)31-21(23,24)25)10-30-12-2-3-16-14(8-12)13-5-6-26-17(9-19(28)29)20(13)27-16/h1-4,7-8,17,26-27H,5-6,9-10H2,(H,28,29)
Reactome pathway
n/an/an/an/a 0.300n/an/an/an/a
Arena Pharmaceuticals Inc.
Curated by ChEMBL
Assay Description
Agonist activity at human S1P1 receptor assessed as change in cAMP level by homogeneous time resolved fluorescence cyclase assay
Bioorg Med Chem Lett 25: 659-63 (2015)
Article DOI: 10.1016/j.bmcl.2014.11.089
BindingDB Entry DOI: 10.7270/Q25T3N5P