null
SMILES: Nc1nc2cc(Cl)c(Cl)cc2n1Cc1ccc(cc1)C(F)(F)F
InChI Key: InChIKey=YVMCQDSKGIJVDG-UHFFFAOYSA-N
Activity Spreadsheet -- Enzyme Inhibition Constant Data from BindingDB
Found 1 hit for monomerid = 50063977
Trg + Lig
Ki
nM
ΔG°
kcal/mole
IC50
nM
Kd
nM
EC50/IC50
nM
koff
s-1
kon
M-1s-1
pHTemp
°C
Reverse transcriptase/RNaseH
(Human immunodeficiency virus 1)
BDBM50063977
(5,6-Dichloro-1-(4-trifluoromethyl-benzyl)-1H-benzo...)
Show SMILES Nc1nc2cc(Cl)c(Cl)cc2n1Cc1ccc(cc1)C(F)(F)F
Show InChI InChI=1S/C15H10Cl2F3N3/c16-10-5-12-13(6-11(10)17)23(14(21)22-12)7-8-1-3-9(4-2-8)15(18,19)20/h1-6H,7H2,(H2,21,22)
n/an/a 2.00E+4n/an/an/an/an/an/a
University of Michigan
Curated by ChEMBL
Assay Description
Antiviral activity against Human Immunodeficiency Virus by Reverse transcriptase assay in CEM-SS cells
J Med Chem 41: 1252-62 (1998)
Article DOI: 10.1021/jm970559i
BindingDB Entry DOI: 10.7270/Q2P26X8J