BDBM50064008 6-Chloro-2-((R)-1-furo[2,3-c]pyridin-5-yl-ethylsulfanyl)-pyrimidin-4-ylamine::CHEMBL26752
SMILES: C[C@@H](Sc1nc(N)cc(Cl)n1)c1cc2ccoc2cn1
InChI Key: InChIKey=ATCRIOJPQXDFNY-SSDOTTSWSA-N
Data: 3 IC50
Activity Spreadsheet -- Enzyme Inhibition Constant Data from BindingDB
Found 3 hits for monomerid = 50064008
Trg + Lig
Ki
nM
ΔG°
kcal/mole
IC50
nM
Kd
nM
EC50/IC50
nM
koff
s-1
kon
M-1s-1
pHTemp
°C
Human immunodeficiency virus type 1 reverse transcriptase
(Human immunodeficiency virus 1)
BDBM50064008
(6-Chloro-2-((R)-1-furo[2,3-c]pyridin-5-yl-ethylsul...)
Show SMILES C[C@@H](Sc1nc(N)cc(Cl)n1)c1cc2ccoc2cn1
Show InChI InChI=1S/C13H11ClN4OS/c1-7(20-13-17-11(14)5-12(15)18-13)9-4-8-2-3-19-10(8)6-16-9/h2-7H,1H3,(H2,15,17,18)/t7-/m1/s1
n/an/a>5.00E+4n/an/an/an/an/an/a
Pharmacia & Upjohn
Curated by ChEMBL
Assay Description
Inhibitory activity against Y181C mutant HIV-1 reverse transcriptase
J Med Chem 41: 1357-60 (1998)
Article DOI: 10.1021/jm9801049
BindingDB Entry DOI: 10.7270/Q2DJ5DS1
Human immunodeficiency virus type 1 reverse transcriptase
(Human immunodeficiency virus 1)
BDBM50064008
(6-Chloro-2-((R)-1-furo[2,3-c]pyridin-5-yl-ethylsul...)
Show SMILES C[C@@H](Sc1nc(N)cc(Cl)n1)c1cc2ccoc2cn1
Show InChI InChI=1S/C13H11ClN4OS/c1-7(20-13-17-11(14)5-12(15)18-13)9-4-8-2-3-19-10(8)6-16-9/h2-7H,1H3,(H2,15,17,18)/t7-/m1/s1
n/an/a 85n/an/an/an/an/an/a
Pharmacia & Upjohn
Curated by ChEMBL
Assay Description
Inhibitory activity against wild type HIV-1 reverse transcriptase (WT-RT)
J Med Chem 41: 1357-60 (1998)
Article DOI: 10.1021/jm9801049
BindingDB Entry DOI: 10.7270/Q2DJ5DS1
Human immunodeficiency virus type 1 reverse transcriptase
(Human immunodeficiency virus 1)
BDBM50064008
(6-Chloro-2-((R)-1-furo[2,3-c]pyridin-5-yl-ethylsul...)
Show SMILES C[C@@H](Sc1nc(N)cc(Cl)n1)c1cc2ccoc2cn1
Show InChI InChI=1S/C13H11ClN4OS/c1-7(20-13-17-11(14)5-12(15)18-13)9-4-8-2-3-19-10(8)6-16-9/h2-7H,1H3,(H2,15,17,18)/t7-/m1/s1
n/an/a 25n/an/an/an/an/an/a
Pharmacia & Upjohn
Curated by ChEMBL
Assay Description
Inhibitory activity against P236L mutant HIV-1 reverse transcriptase
J Med Chem 41: 1357-60 (1998)
Article DOI: 10.1021/jm9801049
BindingDB Entry DOI: 10.7270/Q2DJ5DS1