BDBM50064015 7-Propyl-azepan-(2Z)-ylideneamine; hydrochloride::CHEMBL553271
SMILES: CCCC1CCCCC(N)=N1
InChI Key: InChIKey=BHSPHDLXXIXNCX-UHFFFAOYSA-N
Data: 1 KI  4 IC50
Activity Spreadsheet -- Enzyme Inhibition Constant Data from BindingDB
Found 5 hits for monomerid = 50064015
Trg + Lig
Ki
nM
ΔG°
kcal/mole
IC50
nM
Kd
nM
EC50/IC50
nM
koff
s-1
kon
M-1s-1
pHTemp
°C
Nitric oxide synthase, inducible
(Homo sapiens (Human))
BDBM50064015
(7-Propyl-azepan-(2Z)-ylideneamine; hydrochloride |...)
Show SMILES CCCC1CCCCC(N)=N1 |c:9|
Show InChI InChI=1S/C9H18N2/c1-2-5-8-6-3-4-7-9(10)11-8/h8H,2-7H2,1H3,(H2,10,11)
NCI pathway
Reactome pathway
90n/an/an/an/an/an/an/an/a
Pfizer Inc.
Curated by ChEMBL
Assay Description
Inhibitory activity against L-arginine binding to Inducible nitric oxide synthase
J Med Chem 41: 1361-6 (1998)
Article DOI: 10.1021/jm9704715
BindingDB Entry DOI: 10.7270/Q2348M29
Nitric Oxide Synthase, inducible
(Mus musculus (mouse))
BDBM50064015
(7-Propyl-azepan-(2Z)-ylideneamine; hydrochloride |...)
Show SMILES CCCC1CCCCC(N)=N1 |c:9|
Show InChI InChI=1S/C9H18N2/c1-2-5-8-6-3-4-7-9(10)11-8/h8H,2-7H2,1H3,(H2,10,11)
Reactome pathway
n/an/a 600n/an/an/an/an/an/a
Pfizer Inc.
Curated by ChEMBL
Assay Description
The ability of compound to inhibit mouse Inducible nitric oxide synthase in LPS stimulated mouse RAW cells was determined
J Med Chem 41: 1361-6 (1998)
Article DOI: 10.1021/jm9704715
BindingDB Entry DOI: 10.7270/Q2348M29
Nitric oxide synthase, brain
(Homo sapiens (Human))
BDBM50064015
(7-Propyl-azepan-(2Z)-ylideneamine; hydrochloride |...)
Show SMILES CCCC1CCCCC(N)=N1 |c:9|
Show InChI InChI=1S/C9H18N2/c1-2-5-8-6-3-4-7-9(10)11-8/h8H,2-7H2,1H3,(H2,10,11)
Reactome pathway
n/an/a 460n/an/an/an/an/an/a
Pfizer Inc.
Curated by ChEMBL
Assay Description
Inhibitory activity evaluated from soluble cell extract of human Neuronal nitric oxide synthase and partially purified by DEAE-sepharose chromatograp...
J Med Chem 41: 1361-6 (1998)
Article DOI: 10.1021/jm9704715
BindingDB Entry DOI: 10.7270/Q2348M29
Nitric oxide synthase, inducible
(Homo sapiens (Human))
BDBM50064015
(7-Propyl-azepan-(2Z)-ylideneamine; hydrochloride |...)
Show SMILES CCCC1CCCCC(N)=N1 |c:9|
Show InChI InChI=1S/C9H18N2/c1-2-5-8-6-3-4-7-9(10)11-8/h8H,2-7H2,1H3,(H2,10,11)
NCI pathway
Reactome pathway
n/an/a 160n/an/an/an/an/an/a
Pfizer Inc.
Curated by ChEMBL
Assay Description
Inhibitory activity evaluated for soluble cell extract of human Inducible nitric oxide synthase and partially purified by DEAE-sepharose chromatograp...
J Med Chem 41: 1361-6 (1998)
Article DOI: 10.1021/jm9704715
BindingDB Entry DOI: 10.7270/Q2348M29
Nitric oxide synthase, endothelial
(Homo sapiens (Human))
BDBM50064015
(7-Propyl-azepan-(2Z)-ylideneamine; hydrochloride |...)
Show SMILES CCCC1CCCCC(N)=N1 |c:9|
Show InChI InChI=1S/C9H18N2/c1-2-5-8-6-3-4-7-9(10)11-8/h8H,2-7H2,1H3,(H2,10,11)
n/an/a 9.50E+3n/an/an/an/an/an/a
Pfizer Inc.
Curated by ChEMBL
Assay Description
Inhibitory activity evaluated from soluble cell extract of human endothelia constitutive enzyme (Endothelial nitric oxide synthase) and partially pur...
J Med Chem 41: 1361-6 (1998)
Article DOI: 10.1021/jm9704715
BindingDB Entry DOI: 10.7270/Q2348M29