BDBM50064186 (3Z,5E,7R,8S,9S,11E,13E,15S,16R)-16-{(2S,3R,4S)-4-[(2R,4R,5S,6R)-2,4-dihydroxy-6-isopropyl-5-methyltetrahydro-2H-pyran-2-yl]-3-hydroxypentan-2-yl}-8-hydroxy-3,15-dimethoxy-5,7,9,11-tetramethyloxacyclohexadeca-3,5,11,13-tetraen-2-one::CHEMBL290814::bafilomycin A1
SMILES: CO[C@H]1\C=C\C=C(C)\C[C@H](C)[C@H](O)[C@H](C)\C=C(/C)\C=C(OC)\C(=O)O[C@@H]1[C@@H](C)[C@@H](O)[C@H](C)[C@@]1(O)C[C@@H](O)[C@H](C)[C@H](O1)C(C)C
InChI Key: InChIKey=XDHNQDDQEHDUTM-JQWOJBOSSA-N
Data: 1 KI  3 IC50
Activity Spreadsheet -- Enzyme Inhibition Constant Data from BindingDB
Found 4 hits for monomerid = 50064186
Trg + Lig
Ki
nM
ΔG°
kcal/mole
IC50
nM
Kd
nM
EC50/IC50
nM
koff
s-1
kon
M-1s-1
pHTemp
°C
Adenosine receptor A3
(Homo sapiens (Human))
BDBM50064186
((3Z,5E,7R,8S,9S,11E,13E,15S,16R)-16-{(2S,3R,4S)-4-...)
Show SMILES CO[C@H]1\C=C\C=C(C)\C[C@H](C)[C@H](O)[C@H](C)\C=C(/C)\C=C(OC)\C(=O)O[C@@H]1[C@@H](C)[C@@H](O)[C@H](C)[C@@]1(O)C[C@@H](O)[C@H](C)[C@H](O1)C(C)C |c:5,15,18,t:3|
Show InChI InChI=1S/C35H58O9/c1-19(2)32-24(7)27(36)18-35(40,44-32)26(9)31(38)25(8)33-28(41-10)14-12-13-20(3)15-22(5)30(37)23(6)16-21(4)17-29(42-11)34(39)43-33/h12-14,16-17,19,22-28,30-33,36-38,40H,15,18H2,1-11H3/b14-12+,20-13+,21-16+,29-17-/t22-,23+,24-,25-,26-,27+,28-,30-,31+,32+,33+,35+/m0/s1
Reactome pathway
1.08E+3n/an/an/an/an/an/an/an/a
Universit£t Bonn
Curated by ChEMBL
Assay Description
Displacement of [3H]PSB-11 from human A3 adenosine receptor expressed in CHO cell membranes incubated for 60 mins by liquid scintillation counting me...
J Med Chem 63: 1684-1698 (2020)
Article DOI: 10.1021/acs.jmedchem.9b01887
P2X purinoceptor 3
(Homo sapiens (Human))
BDBM50064186
((3Z,5E,7R,8S,9S,11E,13E,15S,16R)-16-{(2S,3R,4S)-4-...)
Show SMILES CO[C@H]1\C=C\C=C(C)\C[C@H](C)[C@H](O)[C@H](C)\C=C(/C)\C=C(OC)\C(=O)O[C@@H]1[C@@H](C)[C@@H](O)[C@H](C)[C@@]1(O)C[C@@H](O)[C@H](C)[C@H](O1)C(C)C |c:5,15,18,t:3|
Show InChI InChI=1S/C35H58O9/c1-19(2)32-24(7)27(36)18-35(40,44-32)26(9)31(38)25(8)33-28(41-10)14-12-13-20(3)15-22(5)30(37)23(6)16-21(4)17-29(42-11)34(39)43-33/h12-14,16-17,19,22-28,30-33,36-38,40H,15,18H2,1-11H3/b14-12+,20-13+,21-16+,29-17-/t22-,23+,24-,25-,26-,27+,28-,30-,31+,32+,33+,35+/m0/s1
n/an/a 755n/an/an/an/an/an/a
Universit£t Bonn
Curated by ChEMBL
Assay Description
Inhibition of human P2X3 assessed as reduction in agonist-induced intracellular Ca2+ concentration pre-incubated for 30 mins before agonist addition ...
J Med Chem 63: 1684-1698 (2020)
Article DOI: 10.1021/acs.jmedchem.9b01887
Vacuolar ATP synthase subunit S1
(Homo sapiens (Human))
BDBM50064186
((3Z,5E,7R,8S,9S,11E,13E,15S,16R)-16-{(2S,3R,4S)-4-...)
Show SMILES CO[C@H]1\C=C\C=C(C)\C[C@H](C)[C@H](O)[C@H](C)\C=C(/C)\C=C(OC)\C(=O)O[C@@H]1[C@@H](C)[C@@H](O)[C@H](C)[C@@]1(O)C[C@@H](O)[C@H](C)[C@H](O1)C(C)C |c:5,15,18,t:3|
Show InChI InChI=1S/C35H58O9/c1-19(2)32-24(7)27(36)18-35(40,44-32)26(9)31(38)25(8)33-28(41-10)14-12-13-20(3)15-22(5)30(37)23(6)16-21(4)17-29(42-11)34(39)43-33/h12-14,16-17,19,22-28,30-33,36-38,40H,15,18H2,1-11H3/b14-12+,20-13+,21-16+,29-17-/t22-,23+,24-,25-,26-,27+,28-,30-,31+,32+,33+,35+/m0/s1
Reactome pathway
n/an/a 100n/an/an/an/an/an/a
SmithKline Beecham S.p.A.
Curated by ChEMBL
Assay Description
Compound was tested for inhibititon of V-ATPase from Chicken osteoclasts(cOc)
J Med Chem 41: 1568-73 (1998)
Article DOI: 10.1021/jm9800144
BindingDB Entry DOI: 10.7270/Q2CJ8CM6
Adenosinetriphosphatase
(Gallus gallus)
BDBM50064186
((3Z,5E,7R,8S,9S,11E,13E,15S,16R)-16-{(2S,3R,4S)-4-...)
Show SMILES CO[C@H]1\C=C\C=C(C)\C[C@H](C)[C@H](O)[C@H](C)\C=C(/C)\C=C(OC)\C(=O)O[C@@H]1[C@@H](C)[C@@H](O)[C@H](C)[C@@]1(O)C[C@@H](O)[C@H](C)[C@H](O1)C(C)C |c:5,15,18,t:3|
Show InChI InChI=1S/C35H58O9/c1-19(2)32-24(7)27(36)18-35(40,44-32)26(9)31(38)25(8)33-28(41-10)14-12-13-20(3)15-22(5)30(37)23(6)16-21(4)17-29(42-11)34(39)43-33/h12-14,16-17,19,22-28,30-33,36-38,40H,15,18H2,1-11H3/b14-12+,20-13+,21-16+,29-17-/t22-,23+,24-,25-,26-,27+,28-,30-,31+,32+,33+,35+/m0/s1
Reactome pathway
n/an/a 30n/an/an/an/an/an/a
AstraZeneca R&D M£lndal
Curated by ChEMBL
Assay Description
Compound was tested for inhibition of osteoclast vacuolar ATPase derived from chicken medullary bone
Bioorg Med Chem Lett 10: 503-7 (2000)
BindingDB Entry DOI: 10.7270/Q2542P4C