BDBM50064779 CHEMBL3401251
SMILES: Cc1ccc2OCCn3c(nc4cc(Br)ccc34)-c2c1
InChI Key: InChIKey=JGKQCAXGHCWBFD-UHFFFAOYSA-N
Data: 4 IC50
Activity Spreadsheet -- Enzyme Inhibition Constant Data from BindingDB
Found 4 hits for monomerid = 50064779
Trg + Lig
Ki
nM
ΔG°
kcal/mole
IC50
nM
Kd
nM
EC50/IC50
nM
koff
s-1
kon
M-1s-1
pHTemp
°C
Phosphatidylinositol 4,5-bisphosphate 3-kinase catalytic subunit gamma isoform
(Homo sapiens (Human))
BDBM50064779
(CHEMBL3401251)
Show SMILES Cc1ccc2OCCn3c(nc4cc(Br)ccc34)-c2c1
Show InChI InChI=1S/C16H13BrN2O/c1-10-2-5-15-12(8-10)16-18-13-9-11(17)3-4-14(13)19(16)6-7-20-15/h2-5,8-9H,6-7H2,1H3
NCI pathway
Reactome pathway
n/an/a 4.41E+4n/an/an/an/an/an/a
Nanjing University
Curated by ChEMBL
Assay Description
Inhibition of recombinant PI3Kgamma (unknown origin) using PI(3,4)P2 as substrate after 3 hrs incubation by competitive fluorescence polarization kin...
Bioorg Med Chem 23: 1231-40 (2015)
Article DOI: 10.1016/j.bmc.2015.01.052
BindingDB Entry DOI: 10.7270/Q2BC417K
Phosphatidylinositol 4,5-bisphosphate 3-kinase catalytic subunit delta isoform
(Homo sapiens (Human))
BDBM50064779
(CHEMBL3401251)
Show SMILES Cc1ccc2OCCn3c(nc4cc(Br)ccc34)-c2c1
Show InChI InChI=1S/C16H13BrN2O/c1-10-2-5-15-12(8-10)16-18-13-9-11(17)3-4-14(13)19(16)6-7-20-15/h2-5,8-9H,6-7H2,1H3
NCI pathway
Reactome pathway
n/an/a 4.78E+4n/an/an/an/an/an/a
Nanjing University
Curated by ChEMBL
Assay Description
Inhibition of recombinant PI3Kdelta (unknown origin) using PI(3,4)P2 as substrate after 3 hrs incubation by competitive fluorescence polarization kin...
Bioorg Med Chem 23: 1231-40 (2015)
Article DOI: 10.1016/j.bmc.2015.01.052
BindingDB Entry DOI: 10.7270/Q2BC417K
Phosphatidylinositol 4,5-bisphosphate 3-kinase catalytic subunit alpha isoform
(Homo sapiens (Human))
BDBM50064779
(CHEMBL3401251)
Show SMILES Cc1ccc2OCCn3c(nc4cc(Br)ccc34)-c2c1
Show InChI InChI=1S/C16H13BrN2O/c1-10-2-5-15-12(8-10)16-18-13-9-11(17)3-4-14(13)19(16)6-7-20-15/h2-5,8-9H,6-7H2,1H3
NCI pathway
Reactome pathway
n/an/a 662n/an/an/an/an/an/a
Nanjing University
Curated by ChEMBL
Assay Description
Inhibition of recombinant PI3Kalpha (unknown origin) using PI(3,4)P2 as substrate after 3 hrs incubation by competitive fluorescence polarization kin...
Bioorg Med Chem 23: 1231-40 (2015)
Article DOI: 10.1016/j.bmc.2015.01.052
BindingDB Entry DOI: 10.7270/Q2BC417K
Phosphatidylinositol 4,5-bisphosphate 3-kinase catalytic subunit beta isoform
(Homo sapiens (Human))
BDBM50064779
(CHEMBL3401251)
Show SMILES Cc1ccc2OCCn3c(nc4cc(Br)ccc34)-c2c1
Show InChI InChI=1S/C16H13BrN2O/c1-10-2-5-15-12(8-10)16-18-13-9-11(17)3-4-14(13)19(16)6-7-20-15/h2-5,8-9H,6-7H2,1H3
NCI pathway
Reactome pathway
n/an/a 1.03E+3n/an/an/an/an/an/a
Nanjing University
Curated by ChEMBL
Assay Description
Inhibition of recombinant PI3Kbeta (unknown origin) using PI(3,4)P2 as substrate after 3 hrs incubation by competitive fluorescence polarization kina...
Bioorg Med Chem 23: 1231-40 (2015)
Article DOI: 10.1016/j.bmc.2015.01.052
BindingDB Entry DOI: 10.7270/Q2BC417K