BDBM50064801 2-(4,7-Dihydroxy-3-methyl-7-oxo-5,9-dihydro-6,8-dioxa-2-aza-7lambda*5*-phospha-benzocyclohepten-1-ylazo)-benzene-1,4-disulfonic acid::CHEMBL304765
SMILES: Cc1nc(N=Nc2cc(ccc2S(O)(=O)=O)S(O)(=O)=O)c2COP(O)(=O)OCc2c1O
InChI Key: InChIKey=GGJCEYXTBFQGRQ-UHFFFAOYSA-N
Data: 4 IC50
Activity Spreadsheet -- Enzyme Inhibition Constant Data from BindingDB
Found 4 hits for monomerid = 50064801
Trg + Lig
Ki
nM
ΔG°
kcal/mole
IC50
nM
Kd
nM
EC50/IC50
nM
koff
s-1
kon
M-1s-1
pHTemp
°C
P2X purinoceptor 1
(RAT)
BDBM50064801
(2-(4,7-Dihydroxy-3-methyl-7-oxo-5,9-dihydro-6,8-di...)
Show SMILES Cc1nc(N=Nc2cc(ccc2S(O)(=O)=O)S(O)(=O)=O)c2COP(O)(=O)OCc2c1O |w:4.3|
Show InChI InChI=1S/C14H14N3O11PS2/c1-7-13(18)9-5-27-29(19,20)28-6-10(9)14(15-7)17-16-11-4-8(30(21,22)23)2-3-12(11)31(24,25)26/h2-4,18H,5-6H2,1H3,(H,19,20)(H,21,22,23)(H,24,25,26)
Reactome pathway
n/an/a 1.02E+4n/an/an/an/an/an/a
National Institute of Diabetes and Digestive and Kidney Diseases
Curated by ChEMBL
Assay Description
Compound was tested in a functional ion channel assay of ATP-induced current at recombinant rat P2X1 receptor expressed in Xenopus oocytes.
J Med Chem 41: 2201-6 (1998)
Article DOI: 10.1021/jm980183o
BindingDB Entry DOI: 10.7270/Q2DB80ZC
P2X purinoceptor 1
(RAT)
BDBM50064801
(2-(4,7-Dihydroxy-3-methyl-7-oxo-5,9-dihydro-6,8-di...)
Show SMILES Cc1nc(N=Nc2cc(ccc2S(O)(=O)=O)S(O)(=O)=O)c2COP(O)(=O)OCc2c1O |w:4.3|
Show InChI InChI=1S/C14H14N3O11PS2/c1-7-13(18)9-5-27-29(19,20)28-6-10(9)14(15-7)17-16-11-4-8(30(21,22)23)2-3-12(11)31(24,25)26/h2-4,18H,5-6H2,1H3,(H,19,20)(H,21,22,23)(H,24,25,26)
Reactome pathway
n/an/a 1.02E+4n/an/an/an/an/an/a
National Institute of Diabetes and Digestive and Kidney Diseases
Curated by ChEMBL
Assay Description
Inhibition of inward ion current elicited by ATP at P2X1 receptor expressed in Xenopus oocytes
J Med Chem 44: 340-9 (2001)
BindingDB Entry DOI: 10.7270/Q2FN15HC
P2X purinoceptor 3
(RAT)
BDBM50064801
(2-(4,7-Dihydroxy-3-methyl-7-oxo-5,9-dihydro-6,8-di...)
Show SMILES Cc1nc(N=Nc2cc(ccc2S(O)(=O)=O)S(O)(=O)=O)c2COP(O)(=O)OCc2c1O |w:4.3|
Show InChI InChI=1S/C14H14N3O11PS2/c1-7-13(18)9-5-27-29(19,20)28-6-10(9)14(15-7)17-16-11-4-8(30(21,22)23)2-3-12(11)31(24,25)26/h2-4,18H,5-6H2,1H3,(H,19,20)(H,21,22,23)(H,24,25,26)
n/an/a 5.83E+4n/an/an/an/an/an/a
National Institute of Diabetes and Digestive and Kidney Diseases
Curated by ChEMBL
Assay Description
Inhibition of inward ion current elicited by ATP was determined at recombinant P2X3 receptor expressed in Xenopus oocytes
J Med Chem 44: 340-9 (2001)
BindingDB Entry DOI: 10.7270/Q2FN15HC
P2X purinoceptor 3
(RAT)
BDBM50064801
(2-(4,7-Dihydroxy-3-methyl-7-oxo-5,9-dihydro-6,8-di...)
Show SMILES Cc1nc(N=Nc2cc(ccc2S(O)(=O)=O)S(O)(=O)=O)c2COP(O)(=O)OCc2c1O |w:4.3|
Show InChI InChI=1S/C14H14N3O11PS2/c1-7-13(18)9-5-27-29(19,20)28-6-10(9)14(15-7)17-16-11-4-8(30(21,22)23)2-3-12(11)31(24,25)26/h2-4,18H,5-6H2,1H3,(H,19,20)(H,21,22,23)(H,24,25,26)
n/an/a 5.83E+4n/an/an/an/an/an/a
National Institute of Diabetes and Digestive and Kidney Diseases
Curated by ChEMBL
Assay Description
Compound was tested in a functional ion channel assay of ATP-induced current at recombinant rat P2X3 receptor expressed in Xenopus oocytes.
J Med Chem 41: 2201-6 (1998)
Article DOI: 10.1021/jm980183o
BindingDB Entry DOI: 10.7270/Q2DB80ZC