BDBM50064864 CHEMBL3401291
SMILES: Cc1c(NC(=O)c2cc3CCCCc3s2)cccc1-c1cn(C)c(=O)c(Nc2ccc(cc2)-c2ncc[nH]2)n1
InChI Key: InChIKey=BZDYUCUCABSNAD-UHFFFAOYSA-N
Data: 2 IC50
Activity Spreadsheet -- Enzyme Inhibition Constant Data from BindingDB
Found 2 hits for monomerid = 50064864
Trg + Lig
Ki
nM
ΔG°
kcal/mole
IC50
nM
Kd
nM
EC50/IC50
nM
koff
s-1
kon
M-1s-1
pHTemp
°C
Tyrosine-protein kinase BTK
(Homo sapiens (Human))
BDBM50064864
(CHEMBL3401291)
Show SMILES Cc1c(NC(=O)c2cc3CCCCc3s2)cccc1-c1cn(C)c(=O)c(Nc2ccc(cc2)-c2ncc[nH]2)n1
Show InChI InChI=1S/C30H28N6O2S/c1-18-22(7-5-8-23(18)35-29(37)26-16-20-6-3-4-9-25(20)39-26)24-17-36(2)30(38)28(34-24)33-21-12-10-19(11-13-21)27-31-14-15-32-27/h5,7-8,10-17H,3-4,6,9H2,1-2H3,(H,31,32)(H,33,34)(H,35,37)
NCI pathway
Reactome pathway
n/an/a 50n/an/an/an/an/an/a
Genentech
Curated by ChEMBL
Assay Description
Inhibition of BTK (unknown origin) by Lanthascreen method
Bioorg Med Chem Lett 25: 1333-7 (2015)
Article DOI: 10.1016/j.bmcl.2015.01.032
BindingDB Entry DOI: 10.7270/Q26Q1ZXS
Tyrosine-protein kinase BTK
(Mus musculus)
BDBM50064864
(CHEMBL3401291)
Show SMILES Cc1c(NC(=O)c2cc3CCCCc3s2)cccc1-c1cn(C)c(=O)c(Nc2ccc(cc2)-c2ncc[nH]2)n1
Show InChI InChI=1S/C30H28N6O2S/c1-18-22(7-5-8-23(18)35-29(37)26-16-20-6-3-4-9-25(20)39-26)24-17-36(2)30(38)28(34-24)33-21-12-10-19(11-13-21)27-31-14-15-32-27/h5,7-8,10-17H,3-4,6,9H2,1-2H3,(H,31,32)(H,33,34)(H,35,37)
n/an/a 2.39E+4n/an/an/an/an/an/a
Genentech
Curated by ChEMBL
Assay Description
Inhibition of BTK-mediated CD86 surface expression in Balb/c mouse splenocytes preincubated for 60 mins before F(ab')2 anti-mouse IgM measured after ...
Bioorg Med Chem Lett 25: 1333-7 (2015)
Article DOI: 10.1016/j.bmcl.2015.01.032
BindingDB Entry DOI: 10.7270/Q26Q1ZXS