null
SMILES: OC(=O)CCCCC(CS)CCCC(O)=O
InChI Key: InChIKey=ADELNZLMRYJCFC-UHFFFAOYSA-N
Activity Spreadsheet -- Enzyme Inhibition Constant Data from BindingDB
Found 1 hit for monomerid = 50064879
Trg + Lig
Ki
nM
ΔG°
kcal/mole
IC50
nM
Kd
nM
EC50/IC50
nM
koff
s-1
kon
M-1s-1
pHTemp
°C
Glutathione S-transferase kappa 1
(Homo sapiens (Human))
BDBM50064879
(5-Mercaptomethyl-decanedioic acid | CHEMBL73552)
Show SMILES OC(=O)CCCCC(CS)CCCC(O)=O
Show InChI InChI=1S/C11H20O4S/c12-10(13)6-2-1-4-9(8-16)5-3-7-11(14)15/h9,16H,1-8H2,(H,12,13)(H,14,15)
n/an/a 1.01E+4n/an/an/an/an/an/a
Université Sidi Mohamed Ben Abdellah
Curated by ChEMBL
Assay Description
Affinity towards recombinant Glutathione S-transferase (GST) Enzyme.
J Med Chem 41: 2278-88 (1998)
Article DOI: 10.1021/jm970518m
BindingDB Entry DOI: 10.7270/Q2154G56