BDBM50065118 CHEMBL311931::N-[4-(5H,11H-Benzo[e]pyrrolo[1,2-a][1,4]diazepine-10-carbonyl)-3-chloro-phenyl]-2,3-dimethyl-benzamide
SMILES: Cc1cccc(C(=O)Nc2ccc(C(=O)N3Cc4cccn4Cc4ccccc34)c(Cl)c2)c1C
InChI Key: InChIKey=DRCJSVOKCHFWFD-UHFFFAOYSA-N
Data: 2 IC50
Activity Spreadsheet -- Enzyme Inhibition Constant Data from BindingDB
Found 2 hits for monomerid = 50065118
Trg + Lig
Ki
nM
ΔG°
kcal/mole
IC50
nM
Kd
nM
EC50/IC50
nM
koff
s-1
kon
M-1s-1
pHTemp
°C
Vasopressin V2 receptor
(Homo sapiens (Human))
BDBM50065118
(CHEMBL311931 | N-[4-(5H,11H-Benzo[e]pyrrolo[1,2-a]...)
Show SMILES Cc1cccc(C(=O)Nc2ccc(C(=O)N3Cc4cccn4Cc4ccccc34)c(Cl)c2)c1C
Show InChI InChI=1S/C28H24ClN3O2/c1-18-7-5-10-23(19(18)2)27(33)30-21-12-13-24(25(29)15-21)28(34)32-17-22-9-6-14-31(22)16-20-8-3-4-11-26(20)32/h3-15H,16-17H2,1-2H3,(H,30,33)
n/an/a 0.5n/an/an/an/an/an/a
Wyeth-Ayerst Research
Curated by ChEMBL
Assay Description
Displacement of [3H]-AVP from human V2 receptor expressed in murine fibroblast cell line (LV2) membranes
J Med Chem 41: 2442-4 (1998)
Article DOI: 10.1021/jm980179c
BindingDB Entry DOI: 10.7270/Q2CC0ZT5
Vasopressin V1a receptor
(Homo sapiens (Human))
BDBM50065118
(CHEMBL311931 | N-[4-(5H,11H-Benzo[e]pyrrolo[1,2-a]...)
Show SMILES Cc1cccc(C(=O)Nc2ccc(C(=O)N3Cc4cccn4Cc4ccccc34)c(Cl)c2)c1C
Show InChI InChI=1S/C28H24ClN3O2/c1-18-7-5-10-23(19(18)2)27(33)30-21-12-13-24(25(29)15-21)28(34)32-17-22-9-6-14-31(22)16-20-8-3-4-11-26(20)32/h3-15H,16-17H2,1-2H3,(H,30,33)
n/an/a 430n/an/an/an/an/an/a
Wyeth-Ayerst Research
Curated by ChEMBL
Assay Description
Displacement of [3H]-AVP from vasopressin receptor (V1a) from human platelet membranes.
J Med Chem 41: 2442-4 (1998)
Article DOI: 10.1021/jm980179c
BindingDB Entry DOI: 10.7270/Q2CC0ZT5