BDBM50065318 3-[1-(3-tert-Butyl-4-methoxy-phenyl)-meth-(Z)-ylidene]-1,3-dihydro-indol-2-one::CHEMBL86945
SMILES: COc1ccc(\C=C2/C(=O)Nc3ccccc23)cc1C(C)(C)C
InChI Key: InChIKey=WBDQHTACMQEIFX-PTNGSMBKSA-N
Data: 5 IC50
Activity Spreadsheet -- Enzyme Inhibition Constant Data from BindingDB
Found 5 hits for monomerid = 50065318
Trg + Lig
Ki
nM
ΔG°
kcal/mole
IC50
nM
Kd
nM
EC50/IC50
nM
koff
s-1
kon
M-1s-1
pHTemp
°C
Platelet-derived growth factor receptor beta
(Homo sapiens (Human))
BDBM50065318
(3-[1-(3-tert-Butyl-4-methoxy-phenyl)-meth-(Z)-ylid...)
Show SMILES COc1ccc(\C=C2/C(=O)Nc3ccccc23)cc1C(C)(C)C
Show InChI InChI=1S/C20H21NO2/c1-20(2,3)16-12-13(9-10-18(16)23-4)11-15-14-7-5-6-8-17(14)21-19(15)22/h5-12H,1-4H3,(H,21,22)/b15-11-
NCI pathway
Reactome pathway
n/an/a>1.00E+5n/an/an/an/an/an/a
SUGEN, Inc.
Curated by ChEMBL
Assay Description
Test concentration required to achieve 50% inhibition of tyrosine phosphorylation on human Platelet-derived growth factor receptor beta (PDGF RTK).
J Med Chem 41: 2588-603 (1998)
Article DOI: 10.1021/jm980123i
BindingDB Entry DOI: 10.7270/Q2G73CTT
Epidermal growth factor receptor
(Homo sapiens (Human))
BDBM50065318
(3-[1-(3-tert-Butyl-4-methoxy-phenyl)-meth-(Z)-ylid...)
Show SMILES COc1ccc(\C=C2/C(=O)Nc3ccccc23)cc1C(C)(C)C
Show InChI InChI=1S/C20H21NO2/c1-20(2,3)16-12-13(9-10-18(16)23-4)11-15-14-7-5-6-8-17(14)21-19(15)22/h5-12H,1-4H3,(H,21,22)/b15-11-
n/an/a>1.00E+5n/an/an/an/an/an/a
SUGEN, Inc.
Curated by ChEMBL
Assay Description
Concentration required to achieve 50% inhibition of tyrosine phosphorylation on human Epidermal growth factor receptor (EGF RTK).
J Med Chem 41: 2588-603 (1998)
Article DOI: 10.1021/jm980123i
BindingDB Entry DOI: 10.7270/Q2G73CTT
Receptor tyrosine-protein kinase erbB-2
(Homo sapiens (Human))
BDBM50065318
(3-[1-(3-tert-Butyl-4-methoxy-phenyl)-meth-(Z)-ylid...)
Show SMILES COc1ccc(\C=C2/C(=O)Nc3ccccc23)cc1C(C)(C)C
Show InChI InChI=1S/C20H21NO2/c1-20(2,3)16-12-13(9-10-18(16)23-4)11-15-14-7-5-6-8-17(14)21-19(15)22/h5-12H,1-4H3,(H,21,22)/b15-11-
n/an/a 1.32E+4n/an/an/an/an/an/a
SUGEN, Inc.
Curated by ChEMBL
Assay Description
Concentration required to achieve 50% inhibition of tyrosine phosphorylation on human Her-2 receptor tyrosine kinase (HER-2 RTK)
J Med Chem 41: 2588-603 (1998)
Article DOI: 10.1021/jm980123i
BindingDB Entry DOI: 10.7270/Q2G73CTT
Vascular endothelial growth factor receptor 1
(Mus musculus)
BDBM50065318
(3-[1-(3-tert-Butyl-4-methoxy-phenyl)-meth-(Z)-ylid...)
Show SMILES COc1ccc(\C=C2/C(=O)Nc3ccccc23)cc1C(C)(C)C
Show InChI InChI=1S/C20H21NO2/c1-20(2,3)16-12-13(9-10-18(16)23-4)11-15-14-7-5-6-8-17(14)21-19(15)22/h5-12H,1-4H3,(H,21,22)/b15-11-
Reactome pathway
n/an/a>1.00E+5n/an/an/an/an/an/a
SUGEN, Inc.
Curated by ChEMBL
Assay Description
Concentration required to achieve 50% inhibition of tyrosine phosphorylation on murine VEGF receptor (FLK-1 RTK).
J Med Chem 41: 2588-603 (1998)
Article DOI: 10.1021/jm980123i
BindingDB Entry DOI: 10.7270/Q2G73CTT
Insulin-like growth factor I receptor
(Homo sapiens (Human))
BDBM50065318
(3-[1-(3-tert-Butyl-4-methoxy-phenyl)-meth-(Z)-ylid...)
Show SMILES COc1ccc(\C=C2/C(=O)Nc3ccccc23)cc1C(C)(C)C
Show InChI InChI=1S/C20H21NO2/c1-20(2,3)16-12-13(9-10-18(16)23-4)11-15-14-7-5-6-8-17(14)21-19(15)22/h5-12H,1-4H3,(H,21,22)/b15-11-
Reactome pathway
n/an/a>1.00E+5n/an/an/an/an/an/a
SUGEN, Inc.
Curated by ChEMBL
Assay Description
Concentration required to achieve 50% inhibition of tyrosine phosphorylation on human Insulin-like growth factor I receptor
J Med Chem 41: 2588-603 (1998)
Article DOI: 10.1021/jm980123i
BindingDB Entry DOI: 10.7270/Q2G73CTT