BDBM50065321 CHEMBL3403845
SMILES: C[C@H](CO)Nc1cc(NS(=O)(=O)N(C)C)nc(SCc2ccccc2)n1
InChI Key: InChIKey=DDXLDICGEKWGSY-GFCCVEGCSA-N
Data: 1 IC50
Activity Spreadsheet -- Enzyme Inhibition Constant Data from BindingDB
Found 1 hit for monomerid = 50065321
Trg + Lig
Ki
nM
ΔG°
kcal/mole
IC50
nM
Kd
nM
EC50/IC50
nM
koff
s-1
kon
M-1s-1
pHTemp
°C
C-X-C chemokine receptor type 2
(Homo sapiens (Human))
BDBM50065321
(CHEMBL3403845)
Show SMILES C[C@H](CO)Nc1cc(NS(=O)(=O)N(C)C)nc(SCc2ccccc2)n1 |r|
Show InChI InChI=1S/C16H23N5O3S2/c1-12(10-22)17-14-9-15(20-26(23,24)21(2)3)19-16(18-14)25-11-13-7-5-4-6-8-13/h4-9,12,22H,10-11H2,1-3H3,(H2,17,18,19,20)/t12-/m1/s1
Reactome pathway
n/an/a 63n/an/an/an/an/an/a
AstraZeneca
Curated by ChEMBL
Assay Description
Displacement of [125I]IL-8 from human recombinant CXCR2 receptor expressed in HEK293 cells by scintillation counting analysis
Bioorg Med Chem Lett 25: 1616-20 (2015)
Article DOI: 10.1016/j.bmcl.2015.01.067
BindingDB Entry DOI: 10.7270/Q2F47QT4