BDBM50065322 CHEMBL3403846
SMILES: C[C@H](CO)Nc1cc(NS(=O)(=O)c2cn(C)cn2)nc(SCc2cccc(F)c2F)n1
InChI Key: InChIKey=DECPOGZAHNWCCQ-LLVKDONJSA-N
Data: 1 IC50
Activity Spreadsheet -- Enzyme Inhibition Constant Data from BindingDB
Found 1 hit for monomerid = 50065322
Trg + Lig
Ki
nM
ΔG°
kcal/mole
IC50
nM
Kd
nM
EC50/IC50
nM
koff
s-1
kon
M-1s-1
pHTemp
°C
C-X-C chemokine receptor type 2
(Homo sapiens (Human))
BDBM50065322
(CHEMBL3403846)
Show SMILES C[C@H](CO)Nc1cc(NS(=O)(=O)c2cn(C)cn2)nc(SCc2cccc(F)c2F)n1 |r|
Show InChI InChI=1S/C18H20F2N6O3S2/c1-11(8-27)22-14-6-15(25-31(28,29)16-7-26(2)10-21-16)24-18(23-14)30-9-12-4-3-5-13(19)17(12)20/h3-7,10-11,27H,8-9H2,1-2H3,(H2,22,23,24,25)/t11-/m1/s1
Reactome pathway
n/an/a 32n/an/an/an/an/an/a
AstraZeneca
Curated by ChEMBL
Assay Description
Displacement of [125I]IL-8 from human recombinant CXCR2 receptor expressed in HEK293 cells by scintillation counting analysis
Bioorg Med Chem Lett 25: 1616-20 (2015)
Article DOI: 10.1016/j.bmcl.2015.01.067
BindingDB Entry DOI: 10.7270/Q2F47QT4