BDBM50065326 CHEMBL3403850
SMILES: C[C@H](CO)Nc1cc(NS(=O)(=O)N2CCC2)nc(SCc2cccc(F)c2F)n1
InChI Key: InChIKey=KSNXUQRPDJFHTM-LLVKDONJSA-N
Data: 1 IC50
Activity Spreadsheet -- Enzyme Inhibition Constant Data from BindingDB
Found 1 hit for monomerid = 50065326
Trg + Lig
Ki
nM
ΔG°
kcal/mole
IC50
nM
Kd
nM
EC50/IC50
nM
koff
s-1
kon
M-1s-1
pHTemp
°C
C-X-C chemokine receptor type 2
(Homo sapiens (Human))
BDBM50065326
(CHEMBL3403850)
Show SMILES C[C@H](CO)Nc1cc(NS(=O)(=O)N2CCC2)nc(SCc2cccc(F)c2F)n1 |r|
Show InChI InChI=1S/C17H21F2N5O3S2/c1-11(9-25)20-14-8-15(23-29(26,27)24-6-3-7-24)22-17(21-14)28-10-12-4-2-5-13(18)16(12)19/h2,4-5,8,11,25H,3,6-7,9-10H2,1H3,(H2,20,21,22,23)/t11-/m1/s1
Reactome pathway
n/an/a 4n/an/an/an/an/an/a
AstraZeneca
Curated by ChEMBL
Assay Description
Displacement of [125I]IL-8 from human recombinant CXCR2 receptor expressed in HEK293 cells by scintillation counting analysis
Bioorg Med Chem Lett 25: 1616-20 (2015)
Article DOI: 10.1016/j.bmcl.2015.01.067
BindingDB Entry DOI: 10.7270/Q2F47QT4