BDBM50065328 CHEMBL3403852
SMILES: C[C@H](CO)Nc1cc(NS(=O)(=O)N2CCCC2)nc(SCc2cccc(F)c2F)n1
InChI Key: InChIKey=PXRZFKNGQMUYCZ-GFCCVEGCSA-N
Data: 1 IC50
Activity Spreadsheet -- Enzyme Inhibition Constant Data from BindingDB
Found 1 hit for monomerid = 50065328
Trg + Lig
Ki
nM
ΔG°
kcal/mole
IC50
nM
Kd
nM
EC50/IC50
nM
koff
s-1
kon
M-1s-1
pHTemp
°C
C-X-C chemokine receptor type 2
(Homo sapiens (Human))
BDBM50065328
(CHEMBL3403852)
Show SMILES C[C@H](CO)Nc1cc(NS(=O)(=O)N2CCCC2)nc(SCc2cccc(F)c2F)n1 |r|
Show InChI InChI=1S/C18H23F2N5O3S2/c1-12(10-26)21-15-9-16(24-30(27,28)25-7-2-3-8-25)23-18(22-15)29-11-13-5-4-6-14(19)17(13)20/h4-6,9,12,26H,2-3,7-8,10-11H2,1H3,(H2,21,22,23,24)/t12-/m1/s1
Reactome pathway
n/an/a 7.90n/an/an/an/an/an/a
AstraZeneca
Curated by ChEMBL
Assay Description
Displacement of [125I]IL-8 from human recombinant CXCR2 receptor expressed in HEK293 cells by scintillation counting analysis
Bioorg Med Chem Lett 25: 1616-20 (2015)
Article DOI: 10.1016/j.bmcl.2015.01.067
BindingDB Entry DOI: 10.7270/Q2F47QT4