BDBM50065625 CHEMBL3400192
SMILES: CCC(CC)CC1(O)CCN(CC1)C(=O)Nc1cccc(Oc2cccc(C)c2)c1
InChI Key: InChIKey=NUXJWDXFRKASNI-UHFFFAOYSA-N
Data: 1 IC50
Activity Spreadsheet -- Enzyme Inhibition Constant Data from BindingDB
Found 1 hit for monomerid = 50065625
Trg + Lig
Ki
nM
ΔG°
kcal/mole
IC50
nM
Kd
nM
EC50/IC50
nM
koff
s-1
kon
M-1s-1
pHTemp
°C
Sphingosine 1-phosphate receptor 2
(Homo sapiens (Human))
BDBM50065625
(CHEMBL3400192)
Show SMILES CCC(CC)CC1(O)CCN(CC1)C(=O)Nc1cccc(Oc2cccc(C)c2)c1
Show InChI InChI=1S/C25H34N2O3/c1-4-20(5-2)18-25(29)12-14-27(15-13-25)24(28)26-21-9-7-11-23(17-21)30-22-10-6-8-19(3)16-22/h6-11,16-17,20,29H,4-5,12-15,18H2,1-3H3,(H,26,28)
NCI pathway
Reactome pathway
n/an/a 1.30E+3n/an/an/an/an/an/a
Ono Pharmaceutical Co.
Curated by ChEMBL
Assay Description
Antagonist activity at human S1P2 receptor overexpressed in CHO cells assessed as increase in intracellular calcium ion concentration incubated 3 min...
Bioorg Med Chem Lett 25: 1479-82 (2015)
Article DOI: 10.1016/j.bmcl.2015.02.029
BindingDB Entry DOI: 10.7270/Q2D79D3G