BDBM50066180 (S)-Pyrrolidine-1,2-dicarboxylic acid 2-{[(S)-1-(benzyl-methyl-carbamoyl)-2-naphthalen-2-yl-ethyl]-amide} 1-[(3-nitro-phenyl)-amide]::CHEMBL107830
SMILES: CN(Cc1ccccc1)C(=O)[C@H](Cc1ccc2ccccc2c1)NC(=O)[C@@H]1CCCN1C(=O)Nc1cccc(c1)[N+]([O-])=O
InChI Key: InChIKey=XYYOTEUPDWFXRK-KYJUHHDHSA-N
Data: 1 KI
Activity Spreadsheet -- Enzyme Inhibition Constant Data from BindingDB
Found 1 hit for monomerid = 50066180
Trg + Lig
Ki
nM
ΔG°
kcal/mole
IC50
nM
Kd
nM
EC50/IC50
nM
koff
s-1
kon
M-1s-1
pHTemp
°C
Substance-P receptor
(Homo sapiens (Human))
BDBM50066180
((S)-Pyrrolidine-1,2-dicarboxylic acid 2-{[(S)-1-(b...)
Show SMILES CN(Cc1ccccc1)C(=O)[C@H](Cc1ccc2ccccc2c1)NC(=O)[C@@H]1CCCN1C(=O)Nc1cccc(c1)[N+]([O-])=O
Show InChI InChI=1S/C33H33N5O5/c1-36(22-23-9-3-2-4-10-23)32(40)29(20-24-16-17-25-11-5-6-12-26(25)19-24)35-31(39)30-15-8-18-37(30)33(41)34-27-13-7-14-28(21-27)38(42)43/h2-7,9-14,16-17,19,21,29-30H,8,15,18,20,22H2,1H3,(H,34,41)(H,35,39)/t29-,30-/m0/s1
Reactome pathway
2.30n/an/an/an/an/an/an/an/a
Novartis Institute for Medical Sciences
Curated by ChEMBL
Assay Description
In vitro binding affinity towards Tachykinin receptor 1 by measuring its ability to displace [3H]SP (0.6 nM) binding to membranes from Cos-7 cells tr...
J Med Chem 41: 3159-73 (1998)
Article DOI: 10.1021/jm970499g
BindingDB Entry DOI: 10.7270/Q2BZ66QJ