null
SMILES: Clc1ccccc1CNC(=S)N1CCC[C@H]1C(=O)NC(c1ccccc1)c1ccccc1
InChI Key: InChIKey=LILPVLVPPHPZEE-QHCPKHFHSA-N
Activity Spreadsheet -- Enzyme Inhibition Constant Data from BindingDB
Found 1 hit for monomerid = 50066239
Trg + Lig
Ki
nM
ΔG°
kcal/mole
IC50
nM
Kd
nM
EC50/IC50
nM
koff
s-1
kon
M-1s-1
pHTemp
°C
Substance-P receptor
(Homo sapiens (Human))
BDBM50066239
((S)-1-(2-Chloro-benzylthiocarbamoyl)-pyrrolidine-2...)
Show SMILES Clc1ccccc1CNC(=S)N1CCC[C@H]1C(=O)NC(c1ccccc1)c1ccccc1
Show InChI InChI=1S/C26H26ClN3OS/c27-22-15-8-7-14-21(22)18-28-26(32)30-17-9-16-23(30)25(31)29-24(19-10-3-1-4-11-19)20-12-5-2-6-13-20/h1-8,10-15,23-24H,9,16-18H2,(H,28,32)(H,29,31)/t23-/m0/s1
Reactome pathway
170n/an/an/an/an/an/an/an/a
Novartis Institute for Medical Sciences
Curated by ChEMBL
Assay Description
In vitro binding affinity towards Tachykinin receptor 1 to displace [3H][Sar9Met(O2)11]-SP (1 nM) binding to rabbit whole brain membranes
J Med Chem 41: 3159-73 (1998)
Article DOI: 10.1021/jm970499g
BindingDB Entry DOI: 10.7270/Q2BZ66QJ