BDBM50066406 (2S,3R,4S)-4-Benzo[1,3]dioxol-5-yl-1-dibutylcarbamoylmethyl-2-(2-oxazol-2-yl-ethyl)-pyrrolidine-3-carboxylic acid::CHEMBL322732
SMILES: CCCCN(CCCC)C(=O)CN1C[C@@H]([C@H]([C@@H]1CCc1ncco1)C(O)=O)c1ccc2OCOc2c1
InChI Key: InChIKey=DSGGUAOBWFVWOV-YZIHRLCOSA-N
Data: 2 IC50
Activity Spreadsheet -- Enzyme Inhibition Constant Data from BindingDB
Found 2 hits for monomerid = 50066406
Trg + Lig
Ki
nM
ΔG°
kcal/mole
IC50
nM
Kd
nM
EC50/IC50
nM
koff
s-1
kon
M-1s-1
pHTemp
°C
EDNRA
(RAT)
BDBM50066406
((2S,3R,4S)-4-Benzo[1,3]dioxol-5-yl-1-dibutylcarbam...)
Show SMILES CCCCN(CCCC)C(=O)CN1C[C@@H]([C@H]([C@@H]1CCc1ncco1)C(O)=O)c1ccc2OCOc2c1
Show InChI InChI=1S/C27H37N3O6/c1-3-5-12-29(13-6-4-2)25(31)17-30-16-20(19-7-9-22-23(15-19)36-18-35-22)26(27(32)33)21(30)8-10-24-28-11-14-34-24/h7,9,11,14-15,20-21,26H,3-6,8,10,12-13,16-18H2,1-2H3,(H,32,33)/t20-,21+,26-/m1/s1
Reactome pathway
n/an/a 2.40n/an/an/an/an/an/a
Abbott Laboratories
Curated by ChEMBL
Assay Description
Binding affinity for endothelin A receptor by measuring its ability to displace [125I]-ET-1 from prolactin secreting rat pituitary cells(MMQ)
J Med Chem 41: 3261-75 (1998)
Article DOI: 10.1021/jm980217s
BindingDB Entry DOI: 10.7270/Q20Z72D4
EDNRB
(Homo sapiens (Human))
BDBM50066406
((2S,3R,4S)-4-Benzo[1,3]dioxol-5-yl-1-dibutylcarbam...)
Show SMILES CCCCN(CCCC)C(=O)CN1C[C@@H]([C@H]([C@@H]1CCc1ncco1)C(O)=O)c1ccc2OCOc2c1
Show InChI InChI=1S/C27H37N3O6/c1-3-5-12-29(13-6-4-2)25(31)17-30-16-20(19-7-9-22-23(15-19)36-18-35-22)26(27(32)33)21(30)8-10-24-28-11-14-34-24/h7,9,11,14-15,20-21,26H,3-6,8,10,12-13,16-18H2,1-2H3,(H,32,33)/t20-,21+,26-/m1/s1
n/an/a>1.00E+5n/an/an/an/an/an/a
Abbott Laboratories
Curated by ChEMBL
Assay Description
Binding affinity for endothelin B receptor by measuring its ability to displace [125I]-ET-3 from porcine cerebellar tissue
J Med Chem 41: 3261-75 (1998)
Article DOI: 10.1021/jm980217s
BindingDB Entry DOI: 10.7270/Q20Z72D4