BDBM50066475 ((S)-1-{N'-[(2S,3S)-2-Hydroxy-3-((S)-2-methoxycarbonylamino-3,3-dimethyl-butyrylamino)-4-phenyl-butyl]-N'-[4-(2-methyl-2H-tetrazol-5-yl)-benzyl]-hydrazinocarbonyl}-2,2-dimethyl-propyl)-carbamic acid methyl ester::CHEMBL115673
SMILES: COC(=O)N[C@H](C(=O)N[C@@H](Cc1ccccc1)[C@@H](O)CN(Cc1ccc(cc1)-c1nnn(C)n1)NC(=O)[C@@H](NC(=O)OC)C(C)(C)C)C(C)(C)C
InChI Key: InChIKey=BFKMYBHUMHOWJH-YVHASNINSA-N
Data: 1 IC50
Activity Spreadsheet -- Enzyme Inhibition Constant Data from BindingDB
Found 1 hit for monomerid = 50066475
Trg + Lig
Ki
nM
ΔG°
kcal/mole
IC50
nM
Kd
nM
EC50/IC50
nM
koff
s-1
kon
M-1s-1
pHTemp
°C
Human immunodeficiency virus type 1 reverse transcriptase
(Human immunodeficiency virus 1)
BDBM50066475
(((S)-1-{N'-[(2S,3S)-2-Hydroxy-3-((S)-2-methoxycarb...)
Show SMILES COC(=O)N[C@H](C(=O)N[C@@H](Cc1ccccc1)[C@@H](O)CN(Cc1ccc(cc1)-c1nnn(C)n1)NC(=O)[C@@H](NC(=O)OC)C(C)(C)C)C(C)(C)C
Show InChI InChI=1S/C35H51N9O7/c1-34(2,3)27(37-32(48)50-8)30(46)36-25(19-22-13-11-10-12-14-22)26(45)21-44(41-31(47)28(35(4,5)6)38-33(49)51-9)20-23-15-17-24(18-16-23)29-39-42-43(7)40-29/h10-18,25-28,45H,19-21H2,1-9H3,(H,36,46)(H,37,48)(H,38,49)(H,41,47)/t25-,26-,27+,28+/m0/s1
n/an/a 27n/an/an/an/an/an/a
Ciba-Geigy AG
Curated by ChEMBL
Assay Description
The percent reduction of the reverse transcriptase (RT) activity in HIV-1/MN-infected MT-2 cells.
J Med Chem 41: 3387-401 (1998)
Article DOI: 10.1021/jm970873c
BindingDB Entry DOI: 10.7270/Q2H1315D