BDBM50066476 CHEMBL333386::{(S)-1-[N'-[(2S,3S)-2-Hydroxy-3-((S)-2-methoxycarbonylamino-3-methyl-butyrylamino)-4-phenyl-butyl]-N'-(4-pyridin-2-yl-benzyl)-hydrazinocarbonyl]-2,2-dimethyl-propyl}-carbamic acid methyl ester
SMILES: COC(=O)N[C@@H](C(C)C)C(=O)N[C@@H](Cc1ccccc1)[C@@H](O)CN(Cc1ccc(cc1)-c1ccccn1)NC(=O)[C@@H](NC(=O)OC)C(C)(C)C
InChI Key: InChIKey=VJVDUCVRWNDZEP-RTNMLALUSA-N
Data: 1 IC50
Activity Spreadsheet -- Enzyme Inhibition Constant Data from BindingDB
Found 1 hit for monomerid = 50066476
Trg + Lig
Ki
nM
ΔG°
kcal/mole
IC50
nM
Kd
nM
EC50/IC50
nM
koff
s-1
kon
M-1s-1
pHTemp
°C
Human immunodeficiency virus type 1 reverse transcriptase
(Human immunodeficiency virus 1)
BDBM50066476
(CHEMBL333386 | {(S)-1-[N'-[(2S,3S)-2-Hydroxy-3-((S...)
Show SMILES COC(=O)N[C@@H](C(C)C)C(=O)N[C@@H](Cc1ccccc1)[C@@H](O)CN(Cc1ccc(cc1)-c1ccccn1)NC(=O)[C@@H](NC(=O)OC)C(C)(C)C
Show InChI InChI=1S/C37H50N6O7/c1-24(2)31(40-35(47)49-6)33(45)39-29(21-25-13-9-8-10-14-25)30(44)23-43(42-34(46)32(37(3,4)5)41-36(48)50-7)22-26-16-18-27(19-17-26)28-15-11-12-20-38-28/h8-20,24,29-32,44H,21-23H2,1-7H3,(H,39,45)(H,40,47)(H,41,48)(H,42,46)/t29-,30-,31-,32+/m0/s1
n/an/a 20n/an/an/an/an/an/a
Ciba-Geigy AG
Curated by ChEMBL
Assay Description
The percent reduction of the reverse transcriptase (RT) activity in HIV-1/MN-infected MT-2 cells.
J Med Chem 41: 3387-401 (1998)
Article DOI: 10.1021/jm970873c
BindingDB Entry DOI: 10.7270/Q2H1315D