BDBM50066539 4-[2-(4-Phenyl-butylamino)-ethyl]-phenol::CHEMBL118969
SMILES: Oc1ccc(CCNCCCCc2ccccc2)cc1
InChI Key: InChIKey=FNRAWMBUHCSCSX-UHFFFAOYSA-N
Data: 3 IC50
Activity Spreadsheet -- Enzyme Inhibition Constant Data from BindingDB
Found 3 hits for monomerid = 50066539
Trg + Lig
Ki
nM
ΔG°
kcal/mole
IC50
nM
Kd
nM
EC50/IC50
nM
koff
s-1
kon
M-1s-1
pHTemp
°C
Glutamate [NMDA] receptor subunit epsilon 2/zeta 1
(Rattus norvegicus (Rat)-RAT)
BDBM50066539
(4-[2-(4-Phenyl-butylamino)-ethyl]-phenol | CHEMBL1...)
Show SMILES Oc1ccc(CCNCCCCc2ccccc2)cc1
Show InChI InChI=1S/C18H23NO/c20-18-11-9-17(10-12-18)13-15-19-14-5-4-8-16-6-2-1-3-7-16/h1-3,6-7,9-12,19-20H,4-5,8,13-15H2
n/an/a 43n/an/an/an/an/an/a
University of Oregon
Curated by ChEMBL
Assay Description
Functional antagonism by electrical assays in Xenopus oocytes expressing the 1A/2B NMDA receptor
J Med Chem 41: 3499-506 (1998)
Article DOI: 10.1021/jm980235+
BindingDB Entry DOI: 10.7270/Q29Z95MM
Glutamate [NMDA] receptor subunit epsilon 3/zeta 1
(RAT-Rattus norvegicus (Rat))
BDBM50066539
(4-[2-(4-Phenyl-butylamino)-ethyl]-phenol | CHEMBL1...)
Show SMILES Oc1ccc(CCNCCCCc2ccccc2)cc1
Show InChI InChI=1S/C18H23NO/c20-18-11-9-17(10-12-18)13-15-19-14-5-4-8-16-6-2-1-3-7-16/h1-3,6-7,9-12,19-20H,4-5,8,13-15H2
n/an/a 6.50E+4n/an/an/an/an/an/a
University of Oregon
Curated by ChEMBL
Assay Description
Functional antagonism by electrical assays in Xenopus oocytes expressing the 1A/2C NMDA receptor
J Med Chem 41: 3499-506 (1998)
Article DOI: 10.1021/jm980235+
BindingDB Entry DOI: 10.7270/Q29Z95MM
Glutamate [NMDA] receptor subunit epsilon 1/zeta 1
(Rattus norvegicus (Rat)-RAT)
BDBM50066539
(4-[2-(4-Phenyl-butylamino)-ethyl]-phenol | CHEMBL1...)
Show SMILES Oc1ccc(CCNCCCCc2ccccc2)cc1
Show InChI InChI=1S/C18H23NO/c20-18-11-9-17(10-12-18)13-15-19-14-5-4-8-16-6-2-1-3-7-16/h1-3,6-7,9-12,19-20H,4-5,8,13-15H2
n/an/a 1.50E+4n/an/an/an/an/an/a
University of Oregon
Curated by ChEMBL
Assay Description
Functional antagonism by electrical assays in Xenopus oocytes expressing 1A/2A NMDA receptor subtype
J Med Chem 41: 3499-506 (1998)
Article DOI: 10.1021/jm980235+
BindingDB Entry DOI: 10.7270/Q29Z95MM