BDBM50066547 4-[2-(6-Phenyl-hexylamino)-ethyl]-phenol::CHEMBL420530
SMILES: Oc1ccc(CCNCCCCCCc2ccccc2)cc1
InChI Key: InChIKey=GWYOLALPGDHNBU-UHFFFAOYSA-N
Data: 3 IC50
Activity Spreadsheet -- Enzyme Inhibition Constant Data from BindingDB
Found 3 hits for monomerid = 50066547
Trg + Lig
Ki
nM
ΔG°
kcal/mole
IC50
nM
Kd
nM
EC50/IC50
nM
koff
s-1
kon
M-1s-1
pHTemp
°C
Glutamate [NMDA] receptor subunit epsilon 3/zeta 1
(RAT-Rattus norvegicus (Rat))
BDBM50066547
(4-[2-(6-Phenyl-hexylamino)-ethyl]-phenol | CHEMBL4...)
Show SMILES Oc1ccc(CCNCCCCCCc2ccccc2)cc1
Show InChI InChI=1S/C20H27NO/c22-20-13-11-19(12-14-20)15-17-21-16-7-2-1-4-8-18-9-5-3-6-10-18/h3,5-6,9-14,21-22H,1-2,4,7-8,15-17H2
n/an/a 3.00E+4n/an/an/an/an/an/a
University of Oregon
Curated by ChEMBL
Assay Description
Functional antagonism by electrical assays in Xenopus oocytes expressing the 1A/2C NMDA receptor
J Med Chem 41: 3499-506 (1998)
Article DOI: 10.1021/jm980235+
BindingDB Entry DOI: 10.7270/Q29Z95MM
Glutamate [NMDA] receptor subunit epsilon 1/zeta 1
(Rattus norvegicus (Rat)-RAT)
BDBM50066547
(4-[2-(6-Phenyl-hexylamino)-ethyl]-phenol | CHEMBL4...)
Show SMILES Oc1ccc(CCNCCCCCCc2ccccc2)cc1
Show InChI InChI=1S/C20H27NO/c22-20-13-11-19(12-14-20)15-17-21-16-7-2-1-4-8-18-9-5-3-6-10-18/h3,5-6,9-14,21-22H,1-2,4,7-8,15-17H2
n/an/a 1.70E+4n/an/an/an/an/an/a
University of Oregon
Curated by ChEMBL
Assay Description
Functional antagonism by electrical assays in Xenopus oocytes expressing 1A/2A NMDA receptor subtype
J Med Chem 41: 3499-506 (1998)
Article DOI: 10.1021/jm980235+
BindingDB Entry DOI: 10.7270/Q29Z95MM
Glutamate [NMDA] receptor subunit epsilon 2/zeta 1
(Rattus norvegicus (Rat)-RAT)
BDBM50066547
(4-[2-(6-Phenyl-hexylamino)-ethyl]-phenol | CHEMBL4...)
Show SMILES Oc1ccc(CCNCCCCCCc2ccccc2)cc1
Show InChI InChI=1S/C20H27NO/c22-20-13-11-19(12-14-20)15-17-21-16-7-2-1-4-8-18-9-5-3-6-10-18/h3,5-6,9-14,21-22H,1-2,4,7-8,15-17H2
n/an/a 35n/an/an/an/an/an/a
University of Oregon
Curated by ChEMBL
Assay Description
Functional antagonism by electrical assays in Xenopus oocytes expressing the 1A/2B NMDA receptor
J Med Chem 41: 3499-506 (1998)
Article DOI: 10.1021/jm980235+
BindingDB Entry DOI: 10.7270/Q29Z95MM