BDBM50066804 CHEMBL3401603
SMILES: CCc1c([nH]c2ccc(Cl)cc12)C(=O)NCCc1cccc(Cl)c1
InChI Key: InChIKey=GUOFMFIPVUTGED-UHFFFAOYSA-N
Data: 1 IC50
Activity Spreadsheet -- Enzyme Inhibition Constant Data from BindingDB
Found 1 hit for monomerid = 50066804
Trg + Lig
Ki
nM
ΔG°
kcal/mole
IC50
nM
Kd
nM
EC50/IC50
nM
koff
s-1
kon
M-1s-1
pHTemp
°C
Cannabinoid receptor 1
(Homo sapiens (Human))
BDBM50066804
(CHEMBL3401603)
Show SMILES CCc1c([nH]c2ccc(Cl)cc12)C(=O)NCCc1cccc(Cl)c1
Show InChI InChI=1S/C19H18Cl2N2O/c1-2-15-16-11-14(21)6-7-17(16)23-18(15)19(24)22-9-8-12-4-3-5-13(20)10-12/h3-7,10-11,23H,2,8-9H2,1H3,(H,22,24)
NCI pathway
Reactome pathway
n/an/a 831n/an/an/an/an/an/a
Research Triangle Institute
Curated by ChEMBL
Assay Description
Antagonist activity at human CB1 receptor expressed in CHO-RD-HGA16 cells assessed as inhibition of CP55940-induced calcium mobilization incubated fo...
Bioorg Med Chem 23: 2195-203 (2015)
Article DOI: 10.1016/j.bmc.2015.02.058
BindingDB Entry DOI: 10.7270/Q29888PG