BDBM50066805 CHEMBL3401604
SMILES: CCc1c([nH]c2ccc(Cl)cc12)C(=O)NCCc1cccc(OC)c1
InChI Key: InChIKey=HXWVLNNFTRICEJ-UHFFFAOYSA-N
Data: 1 IC50
Activity Spreadsheet -- Enzyme Inhibition Constant Data from BindingDB
Found 1 hit for monomerid = 50066805
Trg + Lig
Ki
nM
ΔG°
kcal/mole
IC50
nM
Kd
nM
EC50/IC50
nM
koff
s-1
kon
M-1s-1
pHTemp
°C
Cannabinoid receptor 1
(Homo sapiens (Human))
BDBM50066805
(CHEMBL3401604)
Show SMILES CCc1c([nH]c2ccc(Cl)cc12)C(=O)NCCc1cccc(OC)c1
Show InChI InChI=1S/C20H21ClN2O2/c1-3-16-17-12-14(21)7-8-18(17)23-19(16)20(24)22-10-9-13-5-4-6-15(11-13)25-2/h4-8,11-12,23H,3,9-10H2,1-2H3,(H,22,24)
NCI pathway
Reactome pathway
n/an/a 2.10E+3n/an/an/an/an/an/a
Research Triangle Institute
Curated by ChEMBL
Assay Description
Antagonist activity at human CB1 receptor expressed in CHO-RD-HGA16 cells assessed as inhibition of CP55940-induced calcium mobilization incubated fo...
Bioorg Med Chem 23: 2195-203 (2015)
Article DOI: 10.1016/j.bmc.2015.02.058
BindingDB Entry DOI: 10.7270/Q29888PG