BDBM50066831 CHEMBL3401612
SMILES: CCc1c([nH]c2ccc(Cl)cc12)C(=O)N1CCN(CC1)c1ccc(Cl)cc1
InChI Key: InChIKey=ADJAEKRETOSJPM-UHFFFAOYSA-N
Data: 1 IC50
Activity Spreadsheet -- Enzyme Inhibition Constant Data from BindingDB
Found 1 hit for monomerid = 50066831
Trg + Lig
Ki
nM
ΔG°
kcal/mole
IC50
nM
Kd
nM
EC50/IC50
nM
koff
s-1
kon
M-1s-1
pHTemp
°C
Cannabinoid receptor 1
(Homo sapiens (Human))
BDBM50066831
(CHEMBL3401612)
Show SMILES CCc1c([nH]c2ccc(Cl)cc12)C(=O)N1CCN(CC1)c1ccc(Cl)cc1
Show InChI InChI=1S/C21H21Cl2N3O/c1-2-17-18-13-15(23)5-8-19(18)24-20(17)21(27)26-11-9-25(10-12-26)16-6-3-14(22)4-7-16/h3-8,13,24H,2,9-12H2,1H3
NCI pathway
Reactome pathway
n/an/a>1.00E+4n/an/an/an/an/an/a
Research Triangle Institute
Curated by ChEMBL
Assay Description
Antagonist activity at human CB1 receptor expressed in CHO-RD-HGA16 cells assessed as inhibition of CP55940-induced calcium mobilization incubated fo...
Bioorg Med Chem 23: 2195-203 (2015)
Article DOI: 10.1016/j.bmc.2015.02.058
BindingDB Entry DOI: 10.7270/Q29888PG