null
SMILES: C\C(\C=C\C=C(/C)c1ccc2OCC(C)(C)c2c1)=C/C(O)=O
InChI Key: InChIKey=COEVCTWDIQBWEC-SEBRYRKESA-N
Activity Spreadsheet -- Enzyme Inhibition Constant Data from BindingDB
Found 4 hits for monomerid = 50066902
Trg + Lig
Ki
nM
ΔG°
kcal/mole
IC50
nM
Kd
nM
EC50/IC50
nM
koff
s-1
kon
M-1s-1
pHTemp
°C
Retinoic acid receptor RXR-alpha
(Homo sapiens (Human))
BDBM50066902
((2E,4E,6E)-7-(3,3-Dimethyl-2,3-dihydro-benzofuran-...)
Show SMILES C\C(\C=C\C=C(/C)c1ccc2OCC(C)(C)c2c1)=C/C(O)=O
Show InChI InChI=1S/C19H22O3/c1-13(10-18(20)21)6-5-7-14(2)15-8-9-17-16(11-15)19(3,4)12-22-17/h5-11H,12H2,1-4H3,(H,20,21)/b6-5+,13-10+,14-7+
NCI pathway
Reactome pathway
n/an/an/an/a 2.80E+3n/an/an/an/a
University of Oklahoma Health Sciences Center
Curated by ChEMBL
Assay Description
Transcriptional activation in CV-1 cells expressing RAR-alpha receptor
J Med Chem 41: 3753-7 (1998)
Article DOI: 10.1021/jm980308p
BindingDB Entry DOI: 10.7270/Q2TB1628
Retinoic acid receptor alpha
(Homo sapiens (Human))
BDBM50066902
((2E,4E,6E)-7-(3,3-Dimethyl-2,3-dihydro-benzofuran-...)
Show SMILES C\C(\C=C\C=C(/C)c1ccc2OCC(C)(C)c2c1)=C/C(O)=O
Show InChI InChI=1S/C19H22O3/c1-13(10-18(20)21)6-5-7-14(2)15-8-9-17-16(11-15)19(3,4)12-22-17/h5-11H,12H2,1-4H3,(H,20,21)/b6-5+,13-10+,14-7+
NCI pathway
Reactome pathway
n/an/an/an/a 800n/an/an/an/a
University of Oklahoma Health Sciences Center
Curated by ChEMBL
Assay Description
Transcriptional activation in CV-1 cells expressing RAR-alpha receptor
J Med Chem 41: 3753-7 (1998)
Article DOI: 10.1021/jm980308p
BindingDB Entry DOI: 10.7270/Q2TB1628
Retinoic acid receptor beta
(Homo sapiens (Human))
BDBM50066902
((2E,4E,6E)-7-(3,3-Dimethyl-2,3-dihydro-benzofuran-...)
Show SMILES C\C(\C=C\C=C(/C)c1ccc2OCC(C)(C)c2c1)=C/C(O)=O
Show InChI InChI=1S/C19H22O3/c1-13(10-18(20)21)6-5-7-14(2)15-8-9-17-16(11-15)19(3,4)12-22-17/h5-11H,12H2,1-4H3,(H,20,21)/b6-5+,13-10+,14-7+
Reactome pathway
n/an/an/an/a 770n/an/an/an/a
University of Oklahoma Health Sciences Center
Curated by ChEMBL
Assay Description
Transcriptional activation in CV-1 cells expressing RAR-beta receptor
J Med Chem 41: 3753-7 (1998)
Article DOI: 10.1021/jm980308p
BindingDB Entry DOI: 10.7270/Q2TB1628
Retinoic acid receptor gamma
(Homo sapiens (Human))
BDBM50066902
((2E,4E,6E)-7-(3,3-Dimethyl-2,3-dihydro-benzofuran-...)
Show SMILES C\C(\C=C\C=C(/C)c1ccc2OCC(C)(C)c2c1)=C/C(O)=O
Show InChI InChI=1S/C19H22O3/c1-13(10-18(20)21)6-5-7-14(2)15-8-9-17-16(11-15)19(3,4)12-22-17/h5-11H,12H2,1-4H3,(H,20,21)/b6-5+,13-10+,14-7+
Reactome pathway
n/an/an/an/a 230n/an/an/an/a
University of Oklahoma Health Sciences Center
Curated by ChEMBL
Assay Description
Transcriptional activation in CV-1 cells expressing RAR-gamma receptor
J Med Chem 41: 3753-7 (1998)
Article DOI: 10.1021/jm980308p
BindingDB Entry DOI: 10.7270/Q2TB1628