null
SMILES: Nc1cc(nc(SCc2ccc3ccccc3c2)n1)C(F)(F)F
InChI Key: InChIKey=OHJJJXKRCBKRQV-UHFFFAOYSA-N
Activity Spreadsheet -- Enzyme Inhibition Constant Data from BindingDB
Found 2 hits for monomerid = 50066935
Trg + Lig
Ki
nM
ΔG°
kcal/mole
IC50
nM
Kd
nM
EC50/IC50
nM
koff
s-1
kon
M-1s-1
pHTemp
°C
Reverse transcriptase/RNaseH
(Human immunodeficiency virus 1)
BDBM50066935
(2-(Naphthalen-2-ylmethylsulfanyl)-6-trifluoromethy...)
Show SMILES Nc1cc(nc(SCc2ccc3ccccc3c2)n1)C(F)(F)F
Show InChI InChI=1S/C16H12F3N3S/c17-16(18,19)13-8-14(20)22-15(21-13)23-9-10-5-6-11-3-1-2-4-12(11)7-10/h1-8H,9H2,(H2,20,21,22)
n/an/a 280n/an/an/an/an/an/a
Pharmacia & Upjohn
Curated by ChEMBL
Assay Description
Inhibition of HIV-1 reverse transcriptase (wild type)
J Med Chem 41: 3793-803 (1998)
Article DOI: 10.1021/jm9800806
BindingDB Entry DOI: 10.7270/Q2JS9PKT
Reverse transcriptase/RNaseH
(Human immunodeficiency virus 1)
BDBM50066935
(2-(Naphthalen-2-ylmethylsulfanyl)-6-trifluoromethy...)
Show SMILES Nc1cc(nc(SCc2ccc3ccccc3c2)n1)C(F)(F)F
Show InChI InChI=1S/C16H12F3N3S/c17-16(18,19)13-8-14(20)22-15(21-13)23-9-10-5-6-11-3-1-2-4-12(11)7-10/h1-8H,9H2,(H2,20,21,22)
n/an/a 430n/an/an/an/an/an/a
Pharmacia & Upjohn
Curated by ChEMBL
Assay Description
Inhibition of HIV-1 reverse transcriptase (P236L)
J Med Chem 41: 3793-803 (1998)
Article DOI: 10.1021/jm9800806
BindingDB Entry DOI: 10.7270/Q2JS9PKT