BDBM50066937 (E)-4-(4-Amino-6-chloro-pyrimidin-2-ylsulfanyl)-but-2-enoic acid dimethylamide::CHEMBL333128
SMILES: CN(C)C(=O)\C=C\CSc1nc(N)cc(Cl)n1
InChI Key: InChIKey=ATRVJRPEWVFALJ-ONEGZZNKSA-N
Data: 2 IC50
Activity Spreadsheet -- Enzyme Inhibition Constant Data from BindingDB
Found 2 hits for monomerid = 50066937
Trg + Lig
Ki
nM
ΔG°
kcal/mole
IC50
nM
Kd
nM
EC50/IC50
nM
koff
s-1
kon
M-1s-1
pHTemp
°C
Reverse transcriptase/RNaseH
(Human immunodeficiency virus 1)
BDBM50066937
((E)-4-(4-Amino-6-chloro-pyrimidin-2-ylsulfanyl)-bu...)
Show SMILES CN(C)C(=O)\C=C\CSc1nc(N)cc(Cl)n1
Show InChI InChI=1S/C10H13ClN4OS/c1-15(2)9(16)4-3-5-17-10-13-7(11)6-8(12)14-10/h3-4,6H,5H2,1-2H3,(H2,12,13,14)/b4-3+
n/an/a 200n/an/an/an/an/an/a
Pharmacia & Upjohn
Curated by ChEMBL
Assay Description
Inhibition of HIV-1 reverse transcriptase (wild type)
J Med Chem 41: 3793-803 (1998)
Article DOI: 10.1021/jm9800806
BindingDB Entry DOI: 10.7270/Q2JS9PKT
Reverse transcriptase/RNaseH
(Human immunodeficiency virus 1)
BDBM50066937
((E)-4-(4-Amino-6-chloro-pyrimidin-2-ylsulfanyl)-bu...)
Show SMILES CN(C)C(=O)\C=C\CSc1nc(N)cc(Cl)n1
Show InChI InChI=1S/C10H13ClN4OS/c1-15(2)9(16)4-3-5-17-10-13-7(11)6-8(12)14-10/h3-4,6H,5H2,1-2H3,(H2,12,13,14)/b4-3+
n/an/a 70n/an/an/an/an/an/a
Pharmacia & Upjohn
Curated by ChEMBL
Assay Description
Inhibition of HIV-1 reverse transcriptase (P236L)
J Med Chem 41: 3793-803 (1998)
Article DOI: 10.1021/jm9800806
BindingDB Entry DOI: 10.7270/Q2JS9PKT