BDBM50066948 CHEMBL3403187
SMILES: OC(=O)CCCN1CC(Oc2c(\C=C\c3ccc(OCCCCOc4ccccc4)cc3)cccc12)C(O)=O
InChI Key: InChIKey=KQXMBUWEISAGDL-DTQAZKPQSA-N
Data: 2 IC50
Activity Spreadsheet -- Enzyme Inhibition Constant Data from BindingDB
Found 2 hits for monomerid = 50066948
Trg + Lig
Ki
nM
ΔG°
kcal/mole
IC50
nM
Kd
nM
EC50/IC50
nM
koff
s-1
kon
M-1s-1
pHTemp
°C
Cysteinyl leukotriene receptor 1
(Homo sapiens (Human))
BDBM50066948
(CHEMBL3403187)
Show SMILES OC(=O)CCCN1CC(Oc2c(\C=C\c3ccc(OCCCCOc4ccccc4)cc3)cccc12)C(O)=O
Show InChI InChI=1S/C31H33NO7/c33-29(34)12-7-19-32-22-28(31(35)36)39-30-24(8-6-11-27(30)32)16-13-23-14-17-26(18-15-23)38-21-5-4-20-37-25-9-2-1-3-10-25/h1-3,6,8-11,13-18,28H,4-5,7,12,19-22H2,(H,33,34)(H,35,36)/b16-13+
Reactome pathway
n/an/a 24n/an/an/an/an/an/a
Ono Pharmaceutical Co., Ltd
Curated by ChEMBL
Assay Description
Antagonist activity at human CysLT1 receptor expressed in CHO cells assessed as inhibition of LTD4-inudced intracellular calcium influx preincubated ...
Bioorg Med Chem 23: 2079-97 (2015)
Article DOI: 10.1016/j.bmc.2015.03.011
BindingDB Entry DOI: 10.7270/Q2SB47FF
Cysteinyl leukotriene receptor 2
(Homo sapiens (Human))
BDBM50066948
(CHEMBL3403187)
Show SMILES OC(=O)CCCN1CC(Oc2c(\C=C\c3ccc(OCCCCOc4ccccc4)cc3)cccc12)C(O)=O
Show InChI InChI=1S/C31H33NO7/c33-29(34)12-7-19-32-22-28(31(35)36)39-30-24(8-6-11-27(30)32)16-13-23-14-17-26(18-15-23)38-21-5-4-20-37-25-9-2-1-3-10-25/h1-3,6,8-11,13-18,28H,4-5,7,12,19-22H2,(H,33,34)(H,35,36)/b16-13+
Reactome pathway
n/an/a 0.310n/an/an/an/an/an/a
Ono Pharmaceutical Co., Ltd
Curated by ChEMBL
Assay Description
Antagonist activity at human CysLT1 receptor expressed in CHO cells assessed as inhibition of LTD4-inudced intracellular calcium influx preincubated ...
Bioorg Med Chem 23: 2079-97 (2015)
Article DOI: 10.1016/j.bmc.2015.03.011
BindingDB Entry DOI: 10.7270/Q2SB47FF