BDBM50067589 2-Benzyl-N-[(S)-1-formyl-2-(1H-indol-3-yl)-ethyl]-3-phenyl-propionamide::CHEMBL132652
SMILES: O=C[C@H](Cc1c[nH]c2ccccc12)NC(=O)C(Cc1ccccc1)Cc1ccccc1
InChI Key: InChIKey=OZZFIASWBWOQRN-DEOSSOPVSA-N
Data: 2 IC50
Activity Spreadsheet -- Enzyme Inhibition Constant Data from BindingDB
Found 2 hits for monomerid = 50067589
Trg + Lig
Ki
nM
ΔG°
kcal/mole
IC50
nM
Kd
nM
EC50/IC50
nM
koff
s-1
kon
M-1s-1
pHTemp
°C
Procathepsin L
(Homo sapiens (Human))
BDBM50067589
(2-Benzyl-N-[(S)-1-formyl-2-(1H-indol-3-yl)-ethyl]-...)
Show SMILES O=C[C@H](Cc1c[nH]c2ccccc12)NC(=O)C(Cc1ccccc1)Cc1ccccc1
Show InChI InChI=1S/C27H26N2O2/c30-19-24(17-23-18-28-26-14-8-7-13-25(23)26)29-27(31)22(15-20-9-3-1-4-10-20)16-21-11-5-2-6-12-21/h1-14,18-19,22,24,28H,15-17H2,(H,29,31)/t24-/m0/s1
Reactome pathway
n/an/a 32n/an/an/an/an/an/a
Takeda Chemical Industries, Ltd.
Curated by ChEMBL
Assay Description
Inhibition of human cathepsin L.
J Med Chem 41: 4301-8 (1998)
Article DOI: 10.1021/jm9803065
BindingDB Entry DOI: 10.7270/Q2VQ33CX
Cathepsin B
(Homo sapiens (Human))
BDBM50067589
(2-Benzyl-N-[(S)-1-formyl-2-(1H-indol-3-yl)-ethyl]-...)
Show SMILES O=C[C@H](Cc1c[nH]c2ccccc12)NC(=O)C(Cc1ccccc1)Cc1ccccc1
Show InChI InChI=1S/C27H26N2O2/c30-19-24(17-23-18-28-26-14-8-7-13-25(23)26)29-27(31)22(15-20-9-3-1-4-10-20)16-21-11-5-2-6-12-21/h1-14,18-19,22,24,28H,15-17H2,(H,29,31)/t24-/m0/s1
Reactome pathway
n/an/a>1.00E+3n/an/an/an/an/an/a
Takeda Chemical Industries, Ltd.
Curated by ChEMBL
Assay Description
Inhibition of human cathepsin B
J Med Chem 41: 4301-8 (1998)
Article DOI: 10.1021/jm9803065
BindingDB Entry DOI: 10.7270/Q2VQ33CX