BDBM50067615 (S)-3-Methyl-2-(naphthalene-1-sulfonylamino)-pentanoic acid (2-oxo-ethyl)-amide::CHEMBL135471
SMILES: CCC(C)[C@H](NS(=O)(=O)c1cccc2ccccc12)C(=O)NCC=O
InChI Key: InChIKey=LHIDWAHKSIFHFJ-RUINGEJQSA-N
Data: 2 IC50
Activity Spreadsheet -- Enzyme Inhibition Constant Data from BindingDB
Found 2 hits for monomerid = 50067615
Trg + Lig
Ki
nM
ΔG°
kcal/mole
IC50
nM
Kd
nM
EC50/IC50
nM
koff
s-1
kon
M-1s-1
pHTemp
°C
Cathepsin B
(Homo sapiens (Human))
BDBM50067615
((S)-3-Methyl-2-(naphthalene-1-sulfonylamino)-penta...)
Show SMILES CCC(C)[C@H](NS(=O)(=O)c1cccc2ccccc12)C(=O)NCC=O
Show InChI InChI=1S/C18H22N2O4S/c1-3-13(2)17(18(22)19-11-12-21)20-25(23,24)16-10-6-8-14-7-4-5-9-15(14)16/h4-10,12-13,17,20H,3,11H2,1-2H3,(H,19,22)/t13?,17-/m0/s1
Reactome pathway
n/an/a 3.20E+3n/an/an/an/an/an/a
Takeda Chemical Industries, Ltd.
Curated by ChEMBL
Assay Description
Inhibition of human cathepsin B
J Med Chem 41: 4301-8 (1998)
Article DOI: 10.1021/jm9803065
BindingDB Entry DOI: 10.7270/Q2VQ33CX
Procathepsin L
(Homo sapiens (Human))
BDBM50067615
((S)-3-Methyl-2-(naphthalene-1-sulfonylamino)-penta...)
Show SMILES CCC(C)[C@H](NS(=O)(=O)c1cccc2ccccc12)C(=O)NCC=O
Show InChI InChI=1S/C18H22N2O4S/c1-3-13(2)17(18(22)19-11-12-21)20-25(23,24)16-10-6-8-14-7-4-5-9-15(14)16/h4-10,12-13,17,20H,3,11H2,1-2H3,(H,19,22)/t13?,17-/m0/s1
Reactome pathway
n/an/a 95n/an/an/an/an/an/a
Takeda Chemical Industries, Ltd.
Curated by ChEMBL
Assay Description
Inhibition of human cathepsin L.
J Med Chem 41: 4301-8 (1998)
Article DOI: 10.1021/jm9803065
BindingDB Entry DOI: 10.7270/Q2VQ33CX