BDBM50067882 4-Methoxy-9-methoxymethyl-furo[3,2-g]chromen-7-one::CHEMBL141214
SMILES: COCc1c2occc2c(OC)c2ccc(=O)oc12
InChI Key: InChIKey=ZWXIHMRDDXGSHC-UHFFFAOYSA-N
Data: 1 Kd
Activity Spreadsheet -- Enzyme Inhibition Constant Data from BindingDB
Found 1 hit for monomerid = 50067882
Trg + Lig
Ki
nM
ΔG°
kcal/mole
IC50
nM
Kd
nM
EC50/IC50
nM
koff
s-1
kon
M-1s-1
pHTemp
°C
Voltage-gated potassium channel subunit Kv1.3
(Mus musculus)
BDBM50067882
(4-Methoxy-9-methoxymethyl-furo[3,2-g]chromen-7-one...)
Show SMILES COCc1c2occc2c(OC)c2ccc(=O)oc12
Show InChI InChI=1S/C14H12O5/c1-16-7-10-13-9(5-6-18-13)12(17-2)8-3-4-11(15)19-14(8)10/h3-6H,7H2,1-2H3
Reactome pathway
n/an/an/a 2.80E+4n/an/an/an/an/a
University of Kiel
Curated by ChEMBL
Assay Description
Blockade of peak Kv1.3 potassium currents
J Med Chem 41: 4542-9 (1998)
Article DOI: 10.1021/jm981032o
BindingDB Entry DOI: 10.7270/Q2B56HWK