null
SMILES: OB(O)c1ccc(Cl)s1
InChI Key: InChIKey=JFCLNCVCDFUJPO-UHFFFAOYSA-N
Activity Spreadsheet -- Enzyme Inhibition Constant Data from BindingDB
Found 5 hits for monomerid = 50067891
Trg + Lig
Ki
nM
ΔG°
kcal/mole
IC50
nM
Kd
nM
EC50/IC50
nM
koff
s-1
kon
M-1s-1
pHTemp
°C
Beta-lactamase
(Escherichia coli)
BDBM50067891
(5-chlorothiophen-2-ylboronic acid | 5-chlorothiphe...)
Show SMILES OB(O)c1ccc(Cl)s1
Show InChI InChI=1S/C4H4BClO2S/c6-4-2-1-3(9-4)5(7)8/h1-2,7-8H
410n/an/an/an/an/an/an/an/a
Northwestern University Medical School
Curated by ChEMBL
Assay Description
Inhibitory activity against E. coli AmpC beta-lactamase.
J Med Chem 41: 4577-86 (1998)
Article DOI: 10.1021/jm980343w
BindingDB Entry DOI: 10.7270/Q22N51FX
Trypsin-2
(Homo sapiens (Human))
BDBM50067891
(5-chlorothiophen-2-ylboronic acid | 5-chlorothiphe...)
Show SMILES OB(O)c1ccc(Cl)s1
Show InChI InChI=1S/C4H4BClO2S/c6-4-2-1-3(9-4)5(7)8/h1-2,7-8H
Reactome pathway
n/an/a>2.00E+5n/an/an/an/an/an/a
Northwestern University Medical School
Curated by ChEMBL
Assay Description
Compound was tested for its specificity against beta-trypsin
J Med Chem 41: 4577-86 (1998)
Article DOI: 10.1021/jm980343w
BindingDB Entry DOI: 10.7270/Q22N51FX
D-amino-acid oxidase
(Homo sapiens (Human))
BDBM50067891
(5-chlorothiophen-2-ylboronic acid | 5-chlorothiphe...)
Show SMILES OB(O)c1ccc(Cl)s1
Show InChI InChI=1S/C4H4BClO2S/c6-4-2-1-3(9-4)5(7)8/h1-2,7-8H
Reactome pathway
n/an/a>1.00E+5n/an/an/an/an/an/a
Tokushima University
Curated by ChEMBL
Assay Description
Inhibition of human DAO using D-serine as substrate after 20 mins in presence of FAD
Eur J Med Chem 159: 23-34 (2018)
Article DOI: 10.1016/j.ejmech.2018.09.040
BindingDB Entry DOI: 10.7270/Q28918KH
Chymotrypsinogen A
(Bos taurus (bovine))
BDBM50067891
(5-chlorothiophen-2-ylboronic acid | 5-chlorothiphe...)
Show SMILES OB(O)c1ccc(Cl)s1
Show InChI InChI=1S/C4H4BClO2S/c6-4-2-1-3(9-4)5(7)8/h1-2,7-8H
Reactome pathway
n/an/a>1.00E+5n/an/an/an/an/an/a
Northwestern University Medical School
Curated by ChEMBL
Assay Description
Compound was tested for its specificity against alpha-chymotrypsin
J Med Chem 41: 4577-86 (1998)
Article DOI: 10.1021/jm980343w
BindingDB Entry DOI: 10.7270/Q22N51FX
Beta-lactamase
(Escherichia coli)
BDBM50067891
(5-chlorothiophen-2-ylboronic acid | 5-chlorothiphe...)
Show SMILES OB(O)c1ccc(Cl)s1
Show InChI InChI=1S/C4H4BClO2S/c6-4-2-1-3(9-4)5(7)8/h1-2,7-8H
n/an/a 2.00E+3n/an/an/an/an/an/a
Northwestern University Medical School
Curated by ChEMBL
Assay Description
Compound was tested for its specificity against AmpC beta-lactamase
J Med Chem 41: 4577-86 (1998)
Article DOI: 10.1021/jm980343w
BindingDB Entry DOI: 10.7270/Q22N51FX