null
SMILES: Cc1ccc2cccc(OCc3c(ccc(c3N3CCCC3=O)-n3cccc3CNC(=O)\C=C\c3ccc(cc3)N3CCCC3=O)N3CCCC3=O)c2n1
InChI Key: InChIKey=KLMFGRRYSNJMFL-CJLVFECKSA-N
Activity Spreadsheet -- Enzyme Inhibition Constant Data from BindingDB
Found 2 hits for monomerid = 50067917
Trg + Lig
Ki
nM
ΔG°
kcal/mole
IC50
nM
Kd
nM
EC50/IC50
nM
koff
s-1
kon
M-1s-1
pHTemp
°C
B2 bradykinin receptor
(Homo sapiens (Human))
BDBM50067917
((E)-N-{1-[3-(2-Methyl-quinolin-8-yloxymethyl)-2,4-...)
Show SMILES Cc1ccc2cccc(OCc3c(ccc(c3N3CCCC3=O)-n3cccc3CNC(=O)\C=C\c3ccc(cc3)N3CCCC3=O)N3CCCC3=O)c2n1
Show InChI InChI=1S/C43H42N6O5/c1-29-13-17-31-7-2-9-37(42(31)45-29)54-28-34-35(48-25-5-11-40(48)52)20-21-36(43(34)49-26-6-12-41(49)53)46-23-3-8-33(46)27-44-38(50)22-16-30-14-18-32(19-15-30)47-24-4-10-39(47)51/h2-3,7-9,13-23H,4-6,10-12,24-28H2,1H3,(H,44,50)/b22-16+
n/an/a 0.410n/an/an/an/an/an/a
Fujisawa Pharmaceutical Ltd.
Curated by ChEMBL
Assay Description
Inhibition of the specific binding of [3H]BK to human recombinant Bradykinin receptor B2 expressed in CHO cells.
J Med Chem 41: 4587-98 (1998)
Article DOI: 10.1021/jm980330i
BindingDB Entry DOI: 10.7270/Q2ZK5HBR
B2 bradykinin receptor
(Cavia porcellus)
BDBM50067917
((E)-N-{1-[3-(2-Methyl-quinolin-8-yloxymethyl)-2,4-...)
Show SMILES Cc1ccc2cccc(OCc3c(ccc(c3N3CCCC3=O)-n3cccc3CNC(=O)\C=C\c3ccc(cc3)N3CCCC3=O)N3CCCC3=O)c2n1
Show InChI InChI=1S/C43H42N6O5/c1-29-13-17-31-7-2-9-37(42(31)45-29)54-28-34-35(48-25-5-11-40(48)52)20-21-36(43(34)49-26-6-12-41(49)53)46-23-3-8-33(46)27-44-38(50)22-16-30-14-18-32(19-15-30)47-24-4-10-39(47)51/h2-3,7-9,13-23H,4-6,10-12,24-28H2,1H3,(H,44,50)/b22-16+
Reactome pathway
n/an/a 0.580n/an/an/an/an/an/a
Fujisawa Pharmaceutical Ltd.
Curated by ChEMBL
Assay Description
Inhibition of the specific binding of [3H]BK to Bradykinin receptor B2 in guinea pig ileum membrane preparations
J Med Chem 41: 4587-98 (1998)
Article DOI: 10.1021/jm980330i
BindingDB Entry DOI: 10.7270/Q2ZK5HBR