BDBM50067937 5-(((2R,3S)-2-((R)-1-(3,5-bis(trifluoromethyl)phenyl)ethoxy)-3-phenylmorpholino)methyl)-2H-1,2,4-triazol-3(4H)-one::5-{(2R,3S)-2-[(R)-1-(3,5-Bis-trifluoromethyl-phenyl)-ethoxy]-3-phenyl-morpholin-4-ylmethyl}-2,4-dihydro-[1,2,4]triazol-3-one::CHEMBL142819
SMILES: C[C@@H](O[C@H]1OCCN(Cc2n[nH]c(=O)[nH]2)[C@H]1c1ccccc1)c1cc(cc(c1)C(F)(F)F)C(F)(F)F
InChI Key: InChIKey=YOBMIXIISZAQGF-CAYVGHNUSA-N
Data: 2 IC50
Activity Spreadsheet -- Enzyme Inhibition Constant Data from BindingDB
Found 2 hits for monomerid = 50067937
Trg + Lig
Ki
nM
ΔG°
kcal/mole
IC50
nM
Kd
nM
EC50/IC50
nM
koff
s-1
kon
M-1s-1
pHTemp
°C
Neurokinin 1 receptor
(Homo sapiens (Human))
BDBM50067937
(5-(((2R,3S)-2-((R)-1-(3,5-bis(trifluoromethyl)phen...)
Show SMILES C[C@@H](O[C@H]1OCCN(Cc2n[nH]c(=O)[nH]2)[C@H]1c1ccccc1)c1cc(cc(c1)C(F)(F)F)C(F)(F)F |r|
Show InChI InChI=1S/C23H22F6N4O3/c1-13(15-9-16(22(24,25)26)11-17(10-15)23(27,28)29)36-20-19(14-5-3-2-4-6-14)33(7-8-35-20)12-18-30-21(34)32-31-18/h2-6,9-11,13,19-20H,7-8,12H2,1H3,(H2,30,31,32,34)/t13-,19+,20-/m1/s1
Reactome pathway
n/an/a 0.0900n/an/an/an/an/an/a
Merck Research Laboratories
Curated by ChEMBL
Assay Description
Inhibition of NK1 receptor (unknown origin)
J Med Chem 51: 4359-69 (2008)
Article DOI: 10.1021/jm800219f
BindingDB Entry DOI: 10.7270/Q28915N5
Neurokinin 1 receptor
(Homo sapiens (Human))
BDBM50067937
(5-(((2R,3S)-2-((R)-1-(3,5-bis(trifluoromethyl)phen...)
Show SMILES C[C@@H](O[C@H]1OCCN(Cc2n[nH]c(=O)[nH]2)[C@H]1c1ccccc1)c1cc(cc(c1)C(F)(F)F)C(F)(F)F |r|
Show InChI InChI=1S/C23H22F6N4O3/c1-13(15-9-16(22(24,25)26)11-17(10-15)23(27,28)29)36-20-19(14-5-3-2-4-6-14)33(7-8-35-20)12-18-30-21(34)32-31-18/h2-6,9-11,13,19-20H,7-8,12H2,1H3,(H2,30,31,32,34)/t13-,19+,20-/m1/s1
Reactome pathway
n/an/a 0.880n/an/an/an/an/an/a
Merck Research Laboratories
Curated by ChEMBL
Assay Description
Displacement of [125I]-labeled SP from the human Tachykinin receptor 1 expressed in CHO cells
J Med Chem 41: 4607-14 (1998)
Article DOI: 10.1021/jm980299k
BindingDB Entry DOI: 10.7270/Q2XW4HZ7