BDBM50067939 5-{(2R,3S)-2-[(R)-1-(3-Fluoro-5-trifluoromethyl-phenyl)-ethoxy]-3-phenyl-morpholin-4-ylmethyl}-2,4-dihydro-[1,2,4]triazol-3-one::CHEMBL140626
SMILES: C[C@@H](O[C@H]1OCCN(Cc2n[nH]c(=O)[nH]2)[C@H]1c1ccccc1)c1cc(F)cc(c1)C(F)(F)F
InChI Key: InChIKey=NARUIMYMUWQLQE-CAYVGHNUSA-N
Data: 1 IC50
Activity Spreadsheet -- Enzyme Inhibition Constant Data from BindingDB
Found 1 hit for monomerid = 50067939
Trg + Lig
Ki
nM
ΔG°
kcal/mole
IC50
nM
Kd
nM
EC50/IC50
nM
koff
s-1
kon
M-1s-1
pHTemp
°C
Neurokinin 1 receptor
(Homo sapiens (Human))
BDBM50067939
(5-{(2R,3S)-2-[(R)-1-(3-Fluoro-5-trifluoromethyl-ph...)
Show SMILES C[C@@H](O[C@H]1OCCN(Cc2n[nH]c(=O)[nH]2)[C@H]1c1ccccc1)c1cc(F)cc(c1)C(F)(F)F
Show InChI InChI=1S/C22H22F4N4O3/c1-13(15-9-16(22(24,25)26)11-17(23)10-15)33-20-19(14-5-3-2-4-6-14)30(7-8-32-20)12-18-27-21(31)29-28-18/h2-6,9-11,13,19-20H,7-8,12H2,1H3,(H2,27,28,29,31)/t13-,19+,20-/m1/s1
Reactome pathway
n/an/a 0.100n/an/an/an/an/an/a
Merck Research Laboratories
Curated by ChEMBL
Assay Description
Displacement of [125I]-labeled SP from the human Tachykinin receptor 1 expressed in CHO cells
J Med Chem 41: 4607-14 (1998)
Article DOI: 10.1021/jm980299k
BindingDB Entry DOI: 10.7270/Q2XW4HZ7