BDBM50068102 CHEMBL3402233
SMILES: COC(=O)[C@H]1CCN([C@H]1C)c1ccc(C#N)c2ccccc12
InChI Key: InChIKey=SFTFIXSWTCMWCF-JSGCOSHPSA-N
Data: 1 IC50  1 EC50
Activity Spreadsheet -- Enzyme Inhibition Constant Data from BindingDB
Found 2 hits for monomerid = 50068102
Trg + Lig
Ki
nM
ΔG°
kcal/mole
IC50
nM
Kd
nM
EC50/IC50
nM
koff
s-1
kon
M-1s-1
pHTemp
°C
Androgen Receptor
(Homo sapiens (Human))
BDBM50068102
(CHEMBL3402233)
Show SMILES COC(=O)[C@H]1CCN([C@H]1C)c1ccc(C#N)c2ccccc12 |r|
Show InChI InChI=1S/C18H18N2O2/c1-12-14(18(21)22-2)9-10-20(12)17-8-7-13(11-19)15-5-3-4-6-16(15)17/h3-8,12,14H,9-10H2,1-2H3/t12-,14-/m0/s1
NCI pathway
Reactome pathway
n/an/an/an/a>1.00E+3n/an/an/an/a
Takeda Pharmaceutical Company Ltd
Curated by ChEMBL
Assay Description
Modulation of androgen receptor (unknown origin) expressed in Cos7 cells assessed as luciferase activity after 24 hrs
Bioorg Med Chem 23: 2568-78 (2015)
Article DOI: 10.1016/j.bmc.2015.03.032
BindingDB Entry DOI: 10.7270/Q2JM2C94
Androgen Receptor
(Homo sapiens (Human))
BDBM50068102
(CHEMBL3402233)
Show SMILES COC(=O)[C@H]1CCN([C@H]1C)c1ccc(C#N)c2ccccc12 |r|
Show InChI InChI=1S/C18H18N2O2/c1-12-14(18(21)22-2)9-10-20(12)17-8-7-13(11-19)15-5-3-4-6-16(15)17/h3-8,12,14H,9-10H2,1-2H3/t12-,14-/m0/s1
NCI pathway
Reactome pathway
n/an/a 7.5n/an/an/an/an/an/a
Takeda Pharmaceutical Company Ltd
Curated by ChEMBL
Assay Description
Displacement of [3H]mibolerone from androgen receptor (unknown origin) after 3 hrs
Bioorg Med Chem 23: 2568-78 (2015)
Article DOI: 10.1016/j.bmc.2015.03.032
BindingDB Entry DOI: 10.7270/Q2JM2C94