BDBM50068108 CHEMBL3402236
SMILES: Oc1cnn(c1)-c1cccc(c1)C(F)(F)F
InChI Key: InChIKey=SGZRMGCFXYGLQZ-UHFFFAOYSA-N
Data: 1 IC50
PDB links: 1 PDB ID matches this monomer.
Activity Spreadsheet -- Enzyme Inhibition Constant Data from BindingDB
Found 1 hit for monomerid = 50068108
Trg + Lig
Ki
nM
ΔG°
kcal/mole
IC50
nM
Kd
nM
EC50/IC50
nM
koff
s-1
kon
M-1s-1
pHTemp
°C
EBifunctional epoxide hydrolase 2
(Homo sapiens (Human))
BDBM50068108
(CHEMBL3402236)
Show SMILES Oc1cnn(c1)-c1cccc(c1)C(F)(F)F
Show InChI InChI=1S/C10H7F3N2O/c11-10(12,13)7-2-1-3-8(4-7)15-6-9(16)5-14-15/h1-6,16H
n/an/a 5.20E+4n/an/an/an/an/an/a
Astellas Pharma Inc.
Curated by ChEMBL
Assay Description
Inhibition of C-terminal His6-tagged full-length human soluble epoxide hydrolase expressed in Escherichia coli BL21(DE3) cells pre-incubated for 15 m...
Bioorg Med Chem 23: 2310-7 (2015)
Article DOI: 10.1016/j.bmc.2015.03.083
BindingDB Entry DOI: 10.7270/Q2DV1MKD
3D
3D Structure (crystal)