BDBM50068382 CHEMBL3402336
SMILES: CC(=O)N1N=C(SC11COc2ccccc12)c1cc(F)ccc1F
InChI Key: InChIKey=FPYBALUTWMBHCO-UHFFFAOYSA-N
Data: 1 EC50
Activity Spreadsheet -- Enzyme Inhibition Constant Data from BindingDB
Found 1 hit for monomerid = 50068382
Trg + Lig
Ki
nM
ΔG°
kcal/mole
IC50
nM
Kd
nM
EC50/IC50
nM
koff
s-1
kon
M-1s-1
pHTemp
°C
Kinesin-like protein 1
(Homo sapiens (Human))
BDBM50068382
(CHEMBL3402336)
Show SMILES CC(=O)N1N=C(SC11COc2ccccc12)c1cc(F)ccc1F |c:4|
Show InChI InChI=1S/C17H12F2N2O2S/c1-10(22)21-17(9-23-15-5-3-2-4-13(15)17)24-16(20-21)12-8-11(18)6-7-14(12)19/h2-8H,9H2,1H3
Reactome pathway
n/an/an/an/a 246n/an/an/an/a
Merck Research Laboratories
Curated by ChEMBL
Assay Description
Inhibition of KSP in human HCT116 cells assessed as phos-histone H3 level by immunofluorescent assay
Bioorg Med Chem 23: 2424-34 (2015)
Article DOI: 10.1016/j.bmc.2015.03.052
BindingDB Entry DOI: 10.7270/Q24F1SF2