BDBM50068399 CHEMBL3403389
SMILES: CC(=O)N1N=C(S[C@]11[C@H](CCN)COc2c(F)cccc12)c1cc(F)ccc1F
InChI Key: InChIKey=WBSYKUINPIEBOY-ODXCJYRJSA-N
Data: 1 EC50
Activity Spreadsheet -- Enzyme Inhibition Constant Data from BindingDB
Found 1 hit for monomerid = 50068399
Trg + Lig
Ki
nM
ΔG°
kcal/mole
IC50
nM
Kd
nM
EC50/IC50
nM
koff
s-1
kon
M-1s-1
pHTemp
°C
Kinesin-like protein 1
(Homo sapiens (Human))
BDBM50068399
(CHEMBL3403389)
Show SMILES CC(=O)N1N=C(S[C@]11[C@H](CCN)COc2c(F)cccc12)c1cc(F)ccc1F |r,c:4|
Show InChI InChI=1S/C20H18F3N3O2S/c1-11(27)26-20(29-19(25-26)14-9-13(21)5-6-16(14)22)12(7-8-24)10-28-18-15(20)3-2-4-17(18)23/h2-6,9,12H,7-8,10,24H2,1H3/t12-,20+/m1/s1
Reactome pathway
n/an/an/an/a 5n/an/an/an/a
Merck Research Laboratories
Curated by ChEMBL
Assay Description
Inhibition of KSP in human HCT116 cells assessed as phos-histone H3 level by immunofluorescent assay
Bioorg Med Chem 23: 2424-34 (2015)
Article DOI: 10.1016/j.bmc.2015.03.052
BindingDB Entry DOI: 10.7270/Q24F1SF2