BDBM50068666 4-(2-{3-[1-Naphthalen-1-yl-meth-(E)-ylidene]-3H-inden-1-yl}-ethyl)-morpholine::CHEMBL127644
SMILES: C(CC1=C\C(=C/c2cccc3ccccc23)c2ccccc12)N1CCOCC1
InChI Key: InChIKey=RTRAPBQOJODDGH-PTGBLXJZSA-N
Data: 6 KI  1 IC50  2 EC50
Activity Spreadsheet -- Enzyme Inhibition Constant Data from BindingDB
Found 9 hits for monomerid = 50068666
Trg + Lig
Ki
nM
ΔG°
kcal/mole
IC50
nM
Kd
nM
EC50/IC50
nM
koff
s-1
kon
M-1s-1
pHTemp
°C
Cannabinoid receptor 1
(Homo sapiens (Human))
BDBM50068666
(4-(2-{3-[1-Naphthalen-1-yl-meth-(E)-ylidene]-3H-in...)
Show SMILES C(CC1=C\C(=C/c2cccc3ccccc23)c2ccccc12)N1CCOCC1 |t:2|
Show InChI InChI=1S/C26H25NO/c1-2-9-24-20(6-1)7-5-8-21(24)18-23-19-22(25-10-3-4-11-26(23)25)12-13-27-14-16-28-17-15-27/h1-11,18-19H,12-17H2/b23-18+
NCI pathway
Reactome pathway
2.70n/an/an/an/an/an/an/an/a
Kennesaw State University
Curated by ChEMBL
Assay Description
Compound was evaluated for its binding affinity against Cannabinoid receptor 1 in Guinea pig ileum (GPI) using [3H]CP-55940 ligand
J Med Chem 41: 5177-87 (1999)
Article DOI: 10.1021/jm9801197
BindingDB Entry DOI: 10.7270/Q2ST7QJJ
Cannabinoid receptor 2
(Homo sapiens (Human))
BDBM50068666
(4-(2-{3-[1-Naphthalen-1-yl-meth-(E)-ylidene]-3H-in...)
Show SMILES C(CC1=C\C(=C/c2cccc3ccccc23)c2ccccc12)N1CCOCC1 |t:2|
Show InChI InChI=1S/C26H25NO/c1-2-9-24-20(6-1)7-5-8-21(24)18-23-19-22(25-10-3-4-11-26(23)25)12-13-27-14-16-28-17-15-27/h1-11,18-19H,12-17H2/b23-18+
Reactome pathway
2.70n/an/an/an/an/an/an/an/a
Kennesaw State University
Curated by ChEMBL
Assay Description
Compound was evaluated for its binding affinity against Cannabinoid receptor 2 in Guinea pig ileum (GPI) using [3H]CP-55940 ligand
J Med Chem 41: 5177-87 (1999)
Article DOI: 10.1021/jm9801197
BindingDB Entry DOI: 10.7270/Q2ST7QJJ
Cannabinoid receptor 1
(Homo sapiens (Human))
BDBM50068666
(4-(2-{3-[1-Naphthalen-1-yl-meth-(E)-ylidene]-3H-in...)
Show SMILES C(CC1=C\C(=C/c2cccc3ccccc23)c2ccccc12)N1CCOCC1 |t:2|
Show InChI InChI=1S/C26H25NO/c1-2-9-24-20(6-1)7-5-8-21(24)18-23-19-22(25-10-3-4-11-26(23)25)12-13-27-14-16-28-17-15-27/h1-11,18-19H,12-17H2/b23-18+
NCI pathway
Reactome pathway
4.70n/an/an/an/an/an/an/an/a
Research Triangle Institute
Curated by ChEMBL
Assay Description
Displacement of [3H]-CP55940 from human CB1 receptor
J Med Chem 59: 7525-43 (2016)
Article DOI: 10.1021/acs.jmedchem.6b00516
Cannabinoid receptor 2
(Homo sapiens (Human))
BDBM50068666
(4-(2-{3-[1-Naphthalen-1-yl-meth-(E)-ylidene]-3H-in...)
Show SMILES C(CC1=C\C(=C/c2cccc3ccccc23)c2ccccc12)N1CCOCC1 |t:2|
Show InChI InChI=1S/C26H25NO/c1-2-9-24-20(6-1)7-5-8-21(24)18-23-19-22(25-10-3-4-11-26(23)25)12-13-27-14-16-28-17-15-27/h1-11,18-19H,12-17H2/b23-18+
Reactome pathway
5.60n/an/an/an/an/an/an/an/a
Research Triangle Institute
Curated by ChEMBL
Assay Description
Displacement of [3H]-CP55940 from human CB2 receptor
J Med Chem 59: 7525-43 (2016)
Article DOI: 10.1021/acs.jmedchem.6b00516
Cannabinoid receptor 1
(Homo sapiens (Human))
BDBM50068666
(4-(2-{3-[1-Naphthalen-1-yl-meth-(E)-ylidene]-3H-in...)
Show SMILES C(CC1=C\C(=C/c2cccc3ccccc23)c2ccccc12)N1CCOCC1 |t:2|
Show InChI InChI=1S/C26H25NO/c1-2-9-24-20(6-1)7-5-8-21(24)18-23-19-22(25-10-3-4-11-26(23)25)12-13-27-14-16-28-17-15-27/h1-11,18-19H,12-17H2/b23-18+
NCI pathway
Reactome pathway
11n/an/an/an/an/an/an/an/a
Kennesaw State University
Curated by ChEMBL
Assay Description
Compound was evaluated for its binding affinity against Cannabinoid receptor 1 in Guinea pig ileum (GPI) using [3H]SR-141,716A ligand at site 1
J Med Chem 41: 5177-87 (1999)
Article DOI: 10.1021/jm9801197
BindingDB Entry DOI: 10.7270/Q2ST7QJJ
Cannabinoid receptor 1
(Homo sapiens (Human))
BDBM50068666
(4-(2-{3-[1-Naphthalen-1-yl-meth-(E)-ylidene]-3H-in...)
Show SMILES C(CC1=C\C(=C/c2cccc3ccccc23)c2ccccc12)N1CCOCC1 |t:2|
Show InChI InChI=1S/C26H25NO/c1-2-9-24-20(6-1)7-5-8-21(24)18-23-19-22(25-10-3-4-11-26(23)25)12-13-27-14-16-28-17-15-27/h1-11,18-19H,12-17H2/b23-18+
NCI pathway
Reactome pathway
611n/an/an/an/an/an/an/an/a
Kennesaw State University
Curated by ChEMBL
Assay Description
Compound was evaluated for its binding affinity against Cannabinoid receptor 1 in Guinea pig ileum (GPI) using [3H]SR-141,716A ligand at site 2
J Med Chem 41: 5177-87 (1999)
Article DOI: 10.1021/jm9801197
BindingDB Entry DOI: 10.7270/Q2ST7QJJ
Cannabinoid receptor 2
(Homo sapiens (Human))
BDBM50068666
(4-(2-{3-[1-Naphthalen-1-yl-meth-(E)-ylidene]-3H-in...)
Show SMILES C(CC1=C\C(=C/c2cccc3ccccc23)c2ccccc12)N1CCOCC1 |t:2|
Show InChI InChI=1S/C26H25NO/c1-2-9-24-20(6-1)7-5-8-21(24)18-23-19-22(25-10-3-4-11-26(23)25)12-13-27-14-16-28-17-15-27/h1-11,18-19H,12-17H2/b23-18+
Reactome pathway
n/an/an/an/a 138n/an/an/an/a
Research Triangle Institute
Curated by ChEMBL
Assay Description
Agonist activity at human CB2R expressed in CHO cells by Ca2+ flux assay
J Med Chem 59: 7525-43 (2016)
Article DOI: 10.1021/acs.jmedchem.6b00516
Cannabinoid receptor 1
(Homo sapiens (Human))
BDBM50068666
(4-(2-{3-[1-Naphthalen-1-yl-meth-(E)-ylidene]-3H-in...)
Show SMILES C(CC1=C\C(=C/c2cccc3ccccc23)c2ccccc12)N1CCOCC1 |t:2|
Show InChI InChI=1S/C26H25NO/c1-2-9-24-20(6-1)7-5-8-21(24)18-23-19-22(25-10-3-4-11-26(23)25)12-13-27-14-16-28-17-15-27/h1-11,18-19H,12-17H2/b23-18+
NCI pathway
Reactome pathway
n/an/an/an/a 257n/an/an/an/a
Research Triangle Institute
Curated by ChEMBL
Assay Description
Agonist activity at human CB1R expressed in CHO cells by Ca2+ flux assay
J Med Chem 59: 7525-43 (2016)
Article DOI: 10.1021/acs.jmedchem.6b00516
Cannabinoid receptor
(Rattus norvegicus (Rat)-Rattus norvegicus (rat))
BDBM50068666
(4-(2-{3-[1-Naphthalen-1-yl-meth-(E)-ylidene]-3H-in...)
Show SMILES C(CC1=C\C(=C/c2cccc3ccccc23)c2ccccc12)N1CCOCC1 |t:2|
Show InChI InChI=1S/C26H25NO/c1-2-9-24-20(6-1)7-5-8-21(24)18-23-19-22(25-10-3-4-11-26(23)25)12-13-27-14-16-28-17-15-27/h1-11,18-19H,12-17H2/b23-18+
n/an/a 1.00E+3n/an/an/an/an/an/a
TBA
Curated by ChEMBL
Assay Description
Displacement of 0.5 nM [3H](R)-(+)-WIN-55212-2 from Cannabinoid receptor of rat cerebellar membranes
Bioorg Med Chem Lett 5: 381-386 (1995)
Article DOI: 10.1016/0960-894X(95)00040-Z
BindingDB Entry DOI: 10.7270/Q2571BZN