BDBM50068786 6-(2-Chloro-pyridin-4-ylmethoxy)-6,9-dihydro-1H-purin-2-ylamine::CHEMBL151495
SMILES: NC1=Nc2nc[nH]c2C(N1)OCc1ccnc(Cl)c1
InChI Key: InChIKey=RDYKDNCJYKJBRC-UHFFFAOYSA-N
Data: 2 IC50
Activity Spreadsheet -- Enzyme Inhibition Constant Data from BindingDB
Found 2 hits for monomerid = 50068786
Trg + Lig
Ki
nM
ΔG°
kcal/mole
IC50
nM
Kd
nM
EC50/IC50
nM
koff
s-1
kon
M-1s-1
pHTemp
°C
6-O-methylguanine-DNA methyltransferase
(Homo sapiens (Human))
BDBM50068786
(6-(2-Chloro-pyridin-4-ylmethoxy)-6,9-dihydro-1H-pu...)
Show SMILES NC1=Nc2nc[nH]c2C(N1)OCc1ccnc(Cl)c1 |t:1|
Show InChI InChI=1S/C11H11ClN6O/c12-7-3-6(1-2-14-7)4-19-10-8-9(16-5-15-8)17-11(13)18-10/h1-3,5,10H,4H2,(H,15,16)(H3,13,17,18)
Reactome pathway
n/an/a 40n/an/an/an/an/an/a
Trinity College
Curated by ChEMBL
Assay Description
O6-Alkylguanine-DNA Alkyltransferase-Inactivating Activity (Concentration of inactivator required to produce 50% reduction in ATPase activity)
J Med Chem 41: 5265-71 (1999)
Article DOI: 10.1021/jm9708644
BindingDB Entry DOI: 10.7270/Q2DJ5G9K
6-O-methylguanine-DNA methyltransferase
(Homo sapiens (Human))
BDBM50068786
(6-(2-Chloro-pyridin-4-ylmethoxy)-6,9-dihydro-1H-pu...)
Show SMILES NC1=Nc2nc[nH]c2C(N1)OCc1ccnc(Cl)c1 |t:1|
Show InChI InChI=1S/C11H11ClN6O/c12-7-3-6(1-2-14-7)4-19-10-8-9(16-5-15-8)17-11(13)18-10/h1-3,5,10H,4H2,(H,15,16)(H3,13,17,18)
Reactome pathway
n/an/a 50n/an/an/an/an/an/a
Trinity College
Curated by ChEMBL
Assay Description
O6-Alkylguanine-DNA Alkyltransferase-Inactivating Activity in Raji cells (Concentration of inactivator required to produce 50% reduction in ATPase ac...
J Med Chem 41: 5265-71 (1999)
Article DOI: 10.1021/jm9708644
BindingDB Entry DOI: 10.7270/Q2DJ5G9K