BDBM50069595 (2R,3S)-2-Benzyl-N*1*-((S)-1-carbamoyl-2-phenyl-ethyl)-N*4*-hydroxy-3-(thiophen-2-ylsulfanylmethyl)-succinamide::CHEMBL113764
SMILES: NC(=O)[C@H](Cc1ccccc1)NC(=O)[C@H](Cc1ccccc1)[C@H](CSc1cccs1)C(=O)NO
InChI Key: InChIKey=UJLOAPKMIFCFBZ-HKBOAZHASA-N
Data: 2 IC50
Activity Spreadsheet -- Enzyme Inhibition Constant Data from BindingDB
Found 2 hits for monomerid = 50069595
Trg + Lig
Ki
nM
ΔG°
kcal/mole
IC50
nM
Kd
nM
EC50/IC50
nM
koff
s-1
kon
M-1s-1
pHTemp
°C
Interstitial collagenase
(Homo sapiens (Human))
BDBM50069595
((2R,3S)-2-Benzyl-N*1*-((S)-1-carbamoyl-2-phenyl-et...)
Show SMILES NC(=O)[C@H](Cc1ccccc1)NC(=O)[C@H](Cc1ccccc1)[C@H](CSc1cccs1)C(=O)NO
Show InChI InChI=1S/C25H27N3O4S2/c26-23(29)21(15-18-10-5-2-6-11-18)27-24(30)19(14-17-8-3-1-4-9-17)20(25(31)28-32)16-34-22-12-7-13-33-22/h1-13,19-21,32H,14-16H2,(H2,26,29)(H,27,30)(H,28,31)/t19-,20+,21+/m1/s1
Reactome pathway
n/an/a 930n/an/an/an/an/an/a
SmithKline Beecham Pharmaceuticals
Curated by ChEMBL
Assay Description
Inhibitory activity of the compound towards human recombinant fibroblast collagenase
Bioorg Med Chem Lett 8: 29-34 (1999)
BindingDB Entry DOI: 10.7270/Q2TT4Q3W
Immunoglobulin epsilon Fc receptor
(Homo sapiens (Human))
BDBM50069595
((2R,3S)-2-Benzyl-N*1*-((S)-1-carbamoyl-2-phenyl-et...)
Show SMILES NC(=O)[C@H](Cc1ccccc1)NC(=O)[C@H](Cc1ccccc1)[C@H](CSc1cccs1)C(=O)NO
Show InChI InChI=1S/C25H27N3O4S2/c26-23(29)21(15-18-10-5-2-6-11-18)27-24(30)19(14-17-8-3-1-4-9-17)20(25(31)28-32)16-34-22-12-7-13-33-22/h1-13,19-21,32H,14-16H2,(H2,26,29)(H,27,30)(H,28,31)/t19-,20+,21+/m1/s1
NCI pathway
Reactome pathway
n/an/a 160n/an/an/an/an/an/a
SmithKline Beecham Pharmaceuticals
Curated by ChEMBL
Assay Description
Inhibition against CD23 (IgE receptor) proteolysis in membranes derived from RPM18866 cells
Bioorg Med Chem Lett 8: 29-34 (1999)
BindingDB Entry DOI: 10.7270/Q2TT4Q3W