BDBM50069609 (2R,3S)-2-{2-Biphenyl-4-yl-2-[(E)-hydroxyimino]-ethylsulfanylmethyl}-N*1*-hydroxy-3-isobutyl-N*4*-((S)-1-methylcarbamoyl-2-phenyl-ethyl)-succinamide::CHEMBL114332
SMILES: CNC(=O)[C@H](Cc1ccccc1)NC(=O)[C@H](CC(C)C)[C@H](CSCC(N=O)c1ccc(cc1)-c1ccccc1)C(=O)NO
InChI Key: InChIKey=VUOYXAHTJMIVRD-VRLMGCJKSA-N
Data: 1 IC50
Activity Spreadsheet -- Enzyme Inhibition Constant Data from BindingDB
Found 1 hit for monomerid = 50069609
Trg + Lig
Ki
nM
ΔG°
kcal/mole
IC50
nM
Kd
nM
EC50/IC50
nM
koff
s-1
kon
M-1s-1
pHTemp
°C
Immunoglobulin epsilon Fc receptor
(Homo sapiens (Human))
BDBM50069609
((2R,3S)-2-{2-Biphenyl-4-yl-2-[(E)-hydroxyimino]-et...)
Show SMILES CNC(=O)[C@H](Cc1ccccc1)NC(=O)[C@H](CC(C)C)[C@H](CSCC(N=O)c1ccc(cc1)-c1ccccc1)C(=O)NO
Show InChI InChI=1S/C33H40N4O5S/c1-22(2)18-27(31(38)35-29(33(40)34-3)19-23-10-6-4-7-11-23)28(32(39)37-42)20-43-21-30(36-41)26-16-14-25(15-17-26)24-12-8-5-9-13-24/h4-17,22,27-30,42H,18-21H2,1-3H3,(H,34,40)(H,35,38)(H,37,39)/t27-,28+,29+,30?/m1/s1
NCI pathway
Reactome pathway
n/an/a 130n/an/an/an/an/an/a
SmithKline Beecham Pharmaceuticals
Curated by ChEMBL
Assay Description
Inhibition against CD23 (IgE receptor) proteolysis in membranes derived from RPM18866 cells
Bioorg Med Chem Lett 8: 29-34 (1999)
BindingDB Entry DOI: 10.7270/Q2TT4Q3W