BDBM50069683 CHEMBL1718454
SMILES: COc1ccc(C(=O)\C=C\c2ccc(O)cc2)c(O)c1CC(OO)C(C)=C
InChI Key: InChIKey=AJERVVHSERWGFL-UXBLZVDNSA-N
Data: 1 IC50
Activity Spreadsheet -- Enzyme Inhibition Constant Data from BindingDB
Found 1 hit for monomerid = 50069683
Trg + Lig
Ki
nM
ΔG°
kcal/mole
IC50
nM
Kd
nM
EC50/IC50
nM
koff
s-1
kon
M-1s-1
pHTemp
°C
Protein-tyrosine phosphatase 1B
(Homo sapiens (Human))
BDBM50069683
(CHEMBL1718454)
Show SMILES COc1ccc(C(=O)\C=C\c2ccc(O)cc2)c(O)c1CC(OO)C(C)=C
Show InChI InChI=1S/C21H22O6/c1-13(2)20(27-25)12-17-19(26-3)11-9-16(21(17)24)18(23)10-6-14-4-7-15(22)8-5-14/h4-11,20,22,24-25H,1,12H2,2-3H3/b10-6+
NCI pathway
Reactome pathway
n/an/a 1.40n/an/an/an/an/an/a
Chinese Academy of Sciences
Curated by ChEMBL
Assay Description
Inhibition of PTP1B (unknown origin) using pNPP substrate measured after 3 mins by colorimetric assay
Bioorg Med Chem Lett 25: 2028-32 (2015)
Article DOI: 10.1016/j.bmcl.2015.04.003
BindingDB Entry DOI: 10.7270/Q2XP76M3