BDBM50069789 CHEMBL3407564
SMILES: CC(C)(C)S(=O)(=O)C[C@H](C1CC1)N1[C@@H]([C@H](C[C@](C)(CC(=O)Nc2ccc(cn2)C(O)=O)C1=O)c1cccc(Cl)c1)c1ccc(Cl)cc1
InChI Key: InChIKey=UQSDNKFAAYCQSH-KHRUNOBUSA-N
Data: 1 IC50
Activity Spreadsheet -- Enzyme Inhibition Constant Data from BindingDB
Found 1 hit for monomerid = 50069789
Trg + Lig
Ki
nM
ΔG°
kcal/mole
IC50
nM
Kd
nM
EC50/IC50
nM
koff
s-1
kon
M-1s-1
pHTemp
°C
MDM2-MDMX
(Homo sapiens (Human))
BDBM50069789
(CHEMBL3407564)
Show SMILES CC(C)(C)S(=O)(=O)C[C@H](C1CC1)N1[C@@H]([C@H](C[C@](C)(CC(=O)Nc2ccc(cn2)C(O)=O)C1=O)c1cccc(Cl)c1)c1ccc(Cl)cc1 |r|
Show InChI InChI=1S/C35H39Cl2N3O6S/c1-34(2,3)47(45,46)20-28(21-8-9-21)40-31(22-10-13-25(36)14-11-22)27(23-6-5-7-26(37)16-23)17-35(4,33(40)44)18-30(41)39-29-15-12-24(19-38-29)32(42)43/h5-7,10-16,19,21,27-28,31H,8-9,17-18,20H2,1-4H3,(H,42,43)(H,38,39,41)/t27-,28-,31-,35-/m1/s1
NCI pathway
Reactome pathway
n/an/a 0.210n/an/an/an/an/an/a
Amgen Inc.
Curated by ChEMBL
Assay Description
Binding affinity to human GST-thrombin-tagged MDM2 ( 1 to 188 aa) assessed as inhibition of interaction with human p53 preincubated with compound for...
J Med Chem 57: 10499-511 (2014)
Article DOI: 10.1021/jm501550p
BindingDB Entry DOI: 10.7270/Q2571DPW