BDBM50070143 4-Bromo-N-(4-{2-[(S)-2-hydroxy-3-(4-hydroxy-phenoxy)-propylamino]-ethyl}-phenyl)-benzenesulfonamide::CHEMBL267545
SMILES: O[C@@H](CNCCc1ccc(NS(=O)(=O)c2ccc(Br)cc2)cc1)COc1ccc(O)cc1
InChI Key: InChIKey=VMAXOLZYDATUED-NRFANRHFSA-N
Data: 2 IC50  2 EC50
Activity Spreadsheet -- Enzyme Inhibition Constant Data from BindingDB
Found 4 hits for monomerid = 50070143
Trg + Lig
Ki
nM
ΔG°
kcal/mole
IC50
nM
Kd
nM
EC50/IC50
nM
koff
s-1
kon
M-1s-1
pHTemp
°C
Beta-2 adrenergic receptor
(Homo sapiens (Human))
BDBM50070143
(4-Bromo-N-(4-{2-[(S)-2-hydroxy-3-(4-hydroxy-phenox...)
Show SMILES O[C@@H](CNCCc1ccc(NS(=O)(=O)c2ccc(Br)cc2)cc1)COc1ccc(O)cc1
Show InChI InChI=1S/C23H25BrN2O5S/c24-18-3-11-23(12-4-18)32(29,30)26-19-5-1-17(2-6-19)13-14-25-15-21(28)16-31-22-9-7-20(27)8-10-22/h1-12,21,25-28H,13-16H2/t21-/m0/s1
Reactome pathway
n/an/a 180n/an/an/an/an/an/a
Merck Research Laboratories
Curated by ChEMBL
Assay Description
Binding affinity against cloned human beta-2 adrenergic receptor from CHO cells using [125I]-iodocyanopindolol as the radioligand
Bioorg Med Chem Lett 8: 1101-6 (1999)
BindingDB Entry DOI: 10.7270/Q2VM4BDM
Beta-1 adrenergic receptor
(Homo sapiens (Human))
BDBM50070143
(4-Bromo-N-(4-{2-[(S)-2-hydroxy-3-(4-hydroxy-phenox...)
Show SMILES O[C@@H](CNCCc1ccc(NS(=O)(=O)c2ccc(Br)cc2)cc1)COc1ccc(O)cc1
Show InChI InChI=1S/C23H25BrN2O5S/c24-18-3-11-23(12-4-18)32(29,30)26-19-5-1-17(2-6-19)13-14-25-15-21(28)16-31-22-9-7-20(27)8-10-22/h1-12,21,25-28H,13-16H2/t21-/m0/s1
Reactome pathway
n/an/a 510n/an/an/an/an/an/a
Merck Research Laboratories
Curated by ChEMBL
Assay Description
Tested for binding affinity against cloned human beta-1 adrenergic receptor from CHO cells using [125I]iodocyanopindolol as the radioligand
Bioorg Med Chem Lett 8: 1101-6 (1999)
BindingDB Entry DOI: 10.7270/Q2VM4BDM
Beta-3 adrenergic receptor
(Homo sapiens (Human))
BDBM50070143
(4-Bromo-N-(4-{2-[(S)-2-hydroxy-3-(4-hydroxy-phenox...)
Show SMILES O[C@@H](CNCCc1ccc(NS(=O)(=O)c2ccc(Br)cc2)cc1)COc1ccc(O)cc1
Show InChI InChI=1S/C23H25BrN2O5S/c24-18-3-11-23(12-4-18)32(29,30)26-19-5-1-17(2-6-19)13-14-25-15-21(28)16-31-22-9-7-20(27)8-10-22/h1-12,21,25-28H,13-16H2/t21-/m0/s1
Reactome pathway
n/an/an/an/a 0.770n/an/an/an/a
Merck Research Laboratories
Curated by ChEMBL
Assay Description
Agonist activity against cloned human beta-3 adrenergic receptor
Bioorg Med Chem Lett 8: 1101-6 (1999)
BindingDB Entry DOI: 10.7270/Q2VM4BDM
Beta-1 adrenergic receptor
(Homo sapiens (Human))
BDBM50070143
(4-Bromo-N-(4-{2-[(S)-2-hydroxy-3-(4-hydroxy-phenox...)
Show SMILES O[C@@H](CNCCc1ccc(NS(=O)(=O)c2ccc(Br)cc2)cc1)COc1ccc(O)cc1
Show InChI InChI=1S/C23H25BrN2O5S/c24-18-3-11-23(12-4-18)32(29,30)26-19-5-1-17(2-6-19)13-14-25-15-21(28)16-31-22-9-7-20(27)8-10-22/h1-12,21,25-28H,13-16H2/t21-/m0/s1
Reactome pathway
n/an/an/an/a 340n/an/an/an/a
Merck Research Laboratories
Curated by ChEMBL
Assay Description
Compound was tested for agonist activity against cloned human beta-1 adrenergic receptor
Bioorg Med Chem Lett 8: 1101-6 (1999)
BindingDB Entry DOI: 10.7270/Q2VM4BDM