BDBM50070257 (R)-2-(3-Mercapto-2-oxo-propyl)-nonanoic acid ((S)-2,2-dimethyl-1-methylcarbamoyl-propyl)-amide::CHEMBL16554
SMILES: CCCCCCC[C@H](CC(=O)CS)C(=O)N[C@H](C(=O)NC)C(C)(C)C
InChI Key: InChIKey=ZWDYAHGBOJEURS-GDBMZVCRSA-N
Data: 3 IC50
Activity Spreadsheet -- Enzyme Inhibition Constant Data from BindingDB
Found 3 hits for monomerid = 50070257
Trg + Lig
Ki
nM
ΔG°
kcal/mole
IC50
nM
Kd
nM
EC50/IC50
nM
koff
s-1
kon
M-1s-1
pHTemp
°C
Matrix metalloproteinase-9
(Homo sapiens (Human))
BDBM50070257
((R)-2-(3-Mercapto-2-oxo-propyl)-nonanoic acid ((S)...)
Show SMILES CCCCCCC[C@H](CC(=O)CS)C(=O)N[C@H](C(=O)NC)C(C)(C)C
Show InChI InChI=1S/C19H36N2O3S/c1-6-7-8-9-10-11-14(12-15(22)13-25)17(23)21-16(18(24)20-5)19(2,3)4/h14,16,25H,6-13H2,1-5H3,(H,20,24)(H,21,23)/t14-,16-/m1/s1
Reactome pathway
n/an/a 0.140n/an/an/an/an/an/a
Wyeth-Ayerst Research
Curated by ChEMBL
Assay Description
Inhibition of matrix metalloproteinase-9, gelatinase-B
Bioorg Med Chem Lett 8: 1163-8 (1999)
BindingDB Entry DOI: 10.7270/Q2348JH9
Interstitial collagenase
(Homo sapiens (Human))
BDBM50070257
((R)-2-(3-Mercapto-2-oxo-propyl)-nonanoic acid ((S)...)
Show SMILES CCCCCCC[C@H](CC(=O)CS)C(=O)N[C@H](C(=O)NC)C(C)(C)C
Show InChI InChI=1S/C19H36N2O3S/c1-6-7-8-9-10-11-14(12-15(22)13-25)17(23)21-16(18(24)20-5)19(2,3)4/h14,16,25H,6-13H2,1-5H3,(H,20,24)(H,21,23)/t14-,16-/m1/s1
Reactome pathway
n/an/a 10n/an/an/an/an/an/a
Wyeth-Ayerst Research
Curated by ChEMBL
Assay Description
Inhibition of matrix metalloproteinase-1, Collagenase-1
Bioorg Med Chem Lett 8: 1163-8 (1999)
BindingDB Entry DOI: 10.7270/Q2348JH9
Stromelysin-1
(Homo sapiens (Human))
BDBM50070257
((R)-2-(3-Mercapto-2-oxo-propyl)-nonanoic acid ((S)...)
Show SMILES CCCCCCC[C@H](CC(=O)CS)C(=O)N[C@H](C(=O)NC)C(C)(C)C
Show InChI InChI=1S/C19H36N2O3S/c1-6-7-8-9-10-11-14(12-15(22)13-25)17(23)21-16(18(24)20-5)19(2,3)4/h14,16,25H,6-13H2,1-5H3,(H,20,24)(H,21,23)/t14-,16-/m1/s1
Reactome pathway
n/an/a 8n/an/an/an/an/an/a
Wyeth-Ayerst Research
Curated by ChEMBL
Assay Description
Inhibition of matrix metalloproteinase-3, stromelysin-1
Bioorg Med Chem Lett 8: 1163-8 (1999)
BindingDB Entry DOI: 10.7270/Q2348JH9